program: Orca
programVersion: 5.0.2
elementType: Br Br Br Br O O O N C C C C C C C C C C C C C C C C C C C C C C H H H H H H H H H H H H H H H H H H H
charge: 0
multiplicity: 1
keywords: wb97x-d3
keywords: def2-TZVPP
keywords: def2/J RIJCOSX
keywords: DEFGRID2
keywords: scfconv7
keywords: smallprint printgap noloewdin
keywords: NOSOSCF
formula: C22H19Br4NO3
InChI: InChI=1/C22H19Br4NO3/c1-21(2)17(19(23)22(24,25)26)18(21)20(28)30-16(12-27)13-7-6-10-15(11-13)29-14-8-4-3-5-9-14/h3-11,16-19H,1-2H3
49 atoms
Br 4.067706 -1.661815 -0.802672
Br 3.244852 -0.175558 2.208164
Br 0.769214 -2.081869 2.447377
Br 3.633258 -3.30326 2.186613
O  -2.307705 -0.799792 -0.217353
O  -0.927331 0.942512 0.008489
O  -5.106536 4.340568 -1.205032
N  -5.39437 -1.566203 0.666903
C  0.832757 -0.924767 -1.876005
C  1.381261 -0.8560 -0.485705
C  -0.075002 -1.188706 -0.68583
C  2.319951 -1.889868 0.064872
C  1.096477 -2.119081 -2.760937
C  0.734003 0.367915 -2.647278
C  -1.098235 -0.217154 -0.260905
C  2.499562 -1.848978 1.592146
C  -3.398596 0.034679 0.136615
C  -3.805659 0.98192 -0.969689
C  -4.503773 -0.880738 0.430821
C  -4.220813 2.259281 -0.632052
C  -3.801178 0.565723 -2.295722
C  -4.658345 3.126843 -1.625504
C  -4.226786 1.447434 -3.276554
C  -4.66528 2.724254 -2.955061
C  -5.086524 5.423952 -2.045149
C  -6.251085 6.167696 -2.157266
C  -3.927018 5.809343 -2.706265
C  -6.253067 7.315463 -2.938196
C  -3.946931 6.951401 -3.493133
C  -5.105685 7.70788 -3.612812
H  1.575058 0.155458 -0.14255
H  -0.368526 -2.226905 -0.57574
H  1.985041 -2.898344 -0.19292
H  2.02827 -1.995465 -3.313732
H  1.150033 -3.060691 -2.214503
H  0.292027 -2.218464 -3.491796
H  1.649103 0.517147 -3.222882
H  -0.098897 0.336162 -3.352189
H  0.60568 1.241192 -2.011407
H  -3.184893 0.594143 1.054001
H  -4.213553 2.586133 0.401141
H  -3.478045 -0.430784 -2.567956
H  -4.231941 1.134788 -4.312462
H  -5.010094 3.385667 -3.739186
H  -7.14465 5.854989 -1.631509
H  -3.016047 5.231985 -2.606381
H  -7.160522 7.899358 -3.022231
H  -3.045306 7.254499 -4.00961
H  -5.111886 8.60038 -4.224567
elementType: Br O N C H
nucrepener: 5415.09191120 hartree
twoeener: 9818.53257507 hartree
cpcmener: -0.03158637 hartree
xcener: -389.800328103475 hartree
chargesum: -0.0000000
charge: -0.080470 -0.011950 -0.012033 -0.000830 -0.276759 -0.425418 -0.322520 -0.085866 0.096039 -0.087973 -0.145082 -0.157587 -0.260842 -0.260494 0.377530 0.035646 0.405616 0.032918 -0.226635 -0.236780 -0.228877 0.274768 -0.141469 -0.179031 0.265594 -0.232273 -0.188906 -0.127300 -0.143765 -0.175162 0.117425 0.118157 0.167106 0.098116 0.092105 0.108855 0.101060 0.100117 0.096923 0.143055 0.132822 0.146602 0.159787 0.156363 0.146664 0.158940 0.157685 0.159771 0.158359
qa: -0.0805 -0.0120 -0.0120 -0.0008 -0.2768 -0.4254 -0.3225 -0.0859 0.0960 -0.0880 -0.1451 -0.1576 -0.2608 -0.2605 0.3775 0.0356 0.4056 0.0329 -0.2266 -0.2368 -0.2289 0.2748 -0.1415 -0.1790 0.2656 -0.2323 -0.1889 -0.1273 -0.1438 -0.1752 0.1174 0.1182 0.1671 0.0981 0.0921 0.1089 0.1011 0.1001 0.0969 0.1431 0.1328 0.1466 0.1598 0.1564 0.1467 0.1589 0.1577 0.1598 0.1584
va: 1.1836 1.2227 1.2262 1.2310 2.1207 2.0879 2.0820 3.1140 3.8703 3.7444 3.8677 4.0664 3.8992 3.8982 4.1775 4.3540 3.7140 3.6286 4.0749 4.0908 3.9607 3.7707 3.9241 3.9041 3.6953 4.0083 3.9278 3.8859 3.8874 3.8987 1.0455 1.0249 0.9946 1.0065 1.0038 1.0025 1.0035 1.0015 1.0172 1.0179 1.0193 1.0133 0.9910 0.9967 1.0070 0.9956 0.9894 0.9900 0.9902
dispcorr: -0.028957053 hartree
energy: -11427.174720383844
dipole: -142.98625 143.52382 0.53757 97.01360 -96.39521 0.61838 -96.51495 94.36124 -2.15371
magnitude: 2.30431 au
magnitude: 5.85710 debye
