program: Orca
programVersion: 5.0.2
elementType: Br Br Br Br O O O N C C C C C C C C C C C C C C C C C C C C C C H H H H H H H H H H H H H H H H H H H
charge: 0
multiplicity: 1
keywords: wb97x-d3
keywords: def2-TZVPP
keywords: def2/J RIJCOSX
keywords: DEFGRID2
keywords: scfconv7
keywords: smallprint printgap noloewdin
keywords: NOSOSCF
formula: C22H19Br4NO3
InChI: InChI=1/C22H19Br4NO3/c1-21(2)17(19(23)22(24,25)26)18(21)20(28)30-16(12-27)13-7-6-10-15(11-13)29-14-8-4-3-5-9-14/h3-11,16-19H,1-2H3
49 atoms
Br 3.454707 -2.241357 2.083212
Br 2.118475 -3.765253 -0.720152
Br 1.614342 -0.921551 -1.971367
Br 4.505625 -1.775099 -1.151658
O  -1.660972 0.803418 -0.338776
O  -1.895008 -1.294604 0.404147
O  -5.327932 4.279936 1.52236
N  -2.816263 2.256549 -3.072902
C  0.459722 -0.444981 2.318004
C  0.966217 -1.26779 1.178502
C  0.09925 -0.064617 0.891453
C  2.40041 -1.274249 0.738878
C  1.362964 0.53211 3.031566
C  -0.559501 -1.078451 3.233216
C  -1.240509 -0.287967 0.319051
C  2.640519 -1.905895 -0.644295
C  -2.951424 0.745052 -0.946174
C  -4.028316 1.210278 0.00238
C  -2.861262 1.599832 -2.131977
C  -4.15785 2.562991 0.297481
C  -4.858414 0.273456 0.604172
C  -5.149607 2.974405 1.176411
C  -5.824275 0.697853 1.50526
C  -5.981466 2.044259 1.787527
C  -5.163757 5.282237 0.603897
C  -5.583362 5.164074 -0.715941
C  -4.611451 6.467707 1.068064
C  -5.428028 6.24482 -1.572546
C  -4.476004 7.543876 0.203128
C  -4.875932 7.436157 -1.121569
H  0.461837 -2.223418 1.076246
H  0.599379 0.828628 0.534538
H  2.807719 -0.260043 0.710897
H  1.912699 0.03689 3.832713
H  2.085832 1.015341 2.374132
H  0.762348 1.322599 3.484607
H  -0.04653 -1.564212 4.065009
H  -1.226965 -0.323092 3.651659
H  -1.168591 -1.834217 2.742912
H  -3.173137 -0.267303 -1.297398
H  -3.499089 3.291207 -0.162036
H  -4.755933 -0.778232 0.371513
H  -6.472826 -0.025876 1.981018
H  -6.747146 2.37823 2.476462
H  -6.029912 4.247567 -1.080803
H  -4.29676 6.546658 2.101243
H  -5.749907 6.151682 -2.601844
H  -4.047875 8.468084 0.569362
H  -4.762052 8.273992 -1.796696
elementType: Br O N C H
nucrepener: 5461.11424631 hartree
twoeener: 9864.83449145 hartree
cpcmener: -0.02895481 hartree
xcener: -389.798820727499 hartree
chargesum: -0.0000000
charge: -0.081014 -0.010657 -0.012171 -0.001378 -0.274590 -0.440676 -0.325818 -0.087689 0.098085 -0.098573 -0.152340 -0.153009 -0.260250 -0.264847 0.408581 0.037260 0.418036 0.012410 -0.231247 -0.202890 -0.181116 0.246616 -0.122382 -0.226840 0.293603 -0.197234 -0.254539 -0.139739 -0.116584 -0.189065 0.118010 0.116706 0.167098 0.098133 0.091963 0.109159 0.098654 0.104237 0.095533 0.137803 0.145457 0.144722 0.159274 0.148248 0.154967 0.145943 0.159224 0.156974 0.157953
qa: -0.0810 -0.0107 -0.0122 -0.0014 -0.2746 -0.4407 -0.3258 -0.0877 0.0981 -0.0986 -0.1523 -0.1530 -0.2602 -0.2648 0.4086 0.0373 0.4180 0.0124 -0.2312 -0.2029 -0.1811 0.2466 -0.1224 -0.2268 0.2936 -0.1972 -0.2545 -0.1397 -0.1166 -0.1891 0.1180 0.1167 0.1671 0.0981 0.0920 0.1092 0.0987 0.1042 0.0955 0.1378 0.1455 0.1447 0.1593 0.1482 0.1550 0.1459 0.1592 0.1570 0.1580
va: 1.1830 1.2232 1.2284 1.2296 2.1286 2.0722 2.0856 3.1087 3.8625 3.7374 3.8971 4.0630 3.9014 3.9004 4.1457 4.3478 3.7273 3.6297 4.0712 3.9870 3.9401 3.7759 3.9123 4.0146 3.6876 3.9069 4.0107 3.8905 3.8833 3.9100 1.0449 1.0256 0.9942 1.0061 1.0040 1.0028 1.0028 0.9994 1.0187 1.0181 1.0095 1.0127 0.9896 1.0048 0.9976 1.0084 0.9901 0.9893 0.9905
dispcorr: -0.028988876 hartree
energy: -11427.174751804039
dipole: -149.66054 149.25345 -0.40709 113.00653 -112.55505 0.45148 38.16028 -36.52480 1.63548
magnitude: 1.74480 au
magnitude: 4.43494 debye
