program: Orca
programVersion: 5.0.2
elementType: Br Br Br Br O O O N C C C C C C C C C C C C C C C C C C C C C C H H H H H H H H H H H H H H H H H H H
charge: 0
multiplicity: 1
keywords: wb97x-d3
keywords: def2-TZVPP
keywords: def2/J RIJCOSX
keywords: DEFGRID2
keywords: scfconv7
keywords: smallprint printgap noloewdin
keywords: NOSOSCF
formula: C22H19Br4NO3
InChI: InChI=1/C22H19Br4NO3/c1-21(2)17(19(23)22(24,25)26)18(21)20(28)30-16(12-27)13-7-6-10-15(11-13)29-14-8-4-3-5-9-14/h3-11,16-19H,1-2H3
49 atoms
Br 3.67351 -0.472458 -0.35177
Br 0.882069 1.460976 0.125783
Br -0.260403 -0.662457 2.120509
Br 2.521219 0.659068 2.694351
O  -1.524854 -2.329485 -1.289106
O  -1.804175 -3.755682 0.409088
O  -2.549521 2.715876 -0.178255
N  -3.504154 -1.546626 -3.820926
C  1.475983 -3.117146 -1.159175
C  1.173235 -1.80926 -0.501064
C  0.386714 -3.040803 -0.106547
C  2.052099 -1.15384 0.522539
C  2.690021 -3.922238 -0.758386
C  1.144779 -3.25105 -2.62504
C  -1.074779 -3.104101 -0.292962
C  1.367105 -0.005591 1.285963
C  -2.92304 -2.056946 -1.326632
C  -3.242452 -0.878366 -0.440126
C  -3.23304 -1.773954 -2.728729
C  -2.740223 0.375978 -0.771331
C  -3.97183 -1.066815 0.723483
C  -3.00865 1.455698 0.056211
C  -4.210244 0.019141 1.555919
C  -3.741703 1.277928 1.224779
C  -2.271958 3.158857 -1.442525
C  -3.094786 2.88593 -2.529172
C  -1.153376 3.967759 -1.591102
C  -2.766869 3.402904 -3.774063
C  -0.842583 4.484909 -2.840855
C  -1.63952 4.196294 -3.93936
H  0.648552 -1.1137 -1.147544
H  0.669969 -3.502001 0.833179
H  2.394372 -1.880565 1.263562
H  3.566615 -3.608255 -1.32598
H  2.929613 -3.8440 0.302146
H  2.520239 -4.978916 -0.972616
H  0.905958 -4.286894 -2.872734
H  0.312047 -2.626751 -2.941529
H  2.012351 -2.961253 -3.220681
H  -3.510926 -2.931122 -1.031908
H  -2.152428 0.503063 -1.672448
H  -4.35259 -2.047019 0.979273
H  -4.776949 -0.114601 2.467871
H  -3.938216 2.126026 1.868748
H  -3.984376 2.279296 -2.415769
H  -0.543818 4.213202 -0.730153
H  -3.405781 3.18405 -4.619894
H  0.031215 5.113872 -2.95205
H  -1.390949 4.593991 -4.914419
elementType: Br O N C H
nucrepener: 6056.32169530 hartree
cpcmener: -0.02905244 hartree
xcener: -389.805645200987 hartree
chargesum: -0.0000000
charge: -0.083149 -0.025351 -0.015721 -0.009408 -0.272018 -0.423706 -0.312869 -0.086737 0.100102 -0.104011 -0.113931 -0.162178 -0.266370 -0.258482 0.358954 0.082999 0.402018 0.034103 -0.235279 -0.255661 -0.196736 0.308084 -0.105862 -0.250393 0.319198 -0.222389 -0.283501 -0.129035 -0.111489 -0.191550 0.121062 0.116225 0.165642 0.099633 0.091448 0.108392 0.102797 0.092555 0.097169 0.138520 0.141076 0.143295 0.157419 0.145484 0.156141 0.157804 0.160232 0.157779 0.157694
qa: -0.0831 -0.0254 -0.0157 -0.0094 -0.2720 -0.4237 -0.3129 -0.0867 0.1001 -0.1040 -0.1139 -0.1622 -0.2664 -0.2585 0.3590 0.0830 0.4020 0.0341 -0.2353 -0.2557 -0.1967 0.3081 -0.1059 -0.2504 0.3192 -0.2224 -0.2835 -0.1290 -0.1115 -0.1915 0.1211 0.1162 0.1656 0.0996 0.0914 0.1084 0.1028 0.0926 0.0972 0.1385 0.1411 0.1433 0.1574 0.1455 0.1561 0.1578 0.1602 0.1578 0.1577
va: 1.1816 1.2284 1.2317 1.2258 2.1166 2.0788 2.0836 3.1033 3.8826 3.7127 3.8636 4.0685 3.9051 3.9023 4.2001 4.2928 3.7558 3.6048 4.0676 3.9407 3.9485 3.6780 3.8869 4.0266 3.6565 3.9270 3.9831 3.8763 3.9050 3.9273 1.0340 1.0231 0.9932 1.0053 1.0042 1.0028 1.0008 1.0135 1.0021 1.0187 1.0120 1.0093 0.9892 1.0067 0.9982 1.0049 0.9894 0.9903 0.9906
dispcorr: -0.035869657 hartree
energy: -11427.177245205952
dipole: -73.74499 74.28111 0.53612 -20.59244 20.05677 -0.53567 -63.87935 64.40908 0.52973
magnitude: 0.92465 au
magnitude: 2.35028 debye
