program: Orca
programVersion: 5.0.2
elementType: Br Br Br Br O O O N C C C C C C C C C C C C C C C C C C C C C C H H H H H H H H H H H H H H H H H H H
charge: 0
multiplicity: 1
keywords: wb97x-d3
keywords: def2-TZVPP
keywords: def2/J RIJCOSX
keywords: DEFGRID2
keywords: scfconv7
keywords: smallprint printgap noloewdin
keywords: NOSOSCF
formula: C22H19Br4NO3
InChI: InChI=1/C22H19Br4NO3/c1-21(2)17(19(23)22(24,25)26)18(21)20(28)30-16(12-27)13-7-6-10-15(11-13)29-14-8-4-3-5-9-14/h3-11,16-19H,1-2H3
49 atoms
Br 3.481504 -1.650502 -1.509889
Br 3.185671 1.030289 0.63886
Br 1.465706 -0.747931 2.576882
Br 4.352219 -1.647672 1.81102
O  -2.556668 -1.19598 0.787464
O  -1.51394 0.590479 -0.060894
O  -5.49412 2.81904 -2.241128
N  -5.236761 -1.852913 2.576233
C  -0.010903 -1.860493 -1.498316
C  0.879184 -1.056342 -0.599921
C  -0.439675 -1.552716 -0.073479
C  2.168652 -1.59224 -0.050574
C  0.272731 -3.314627 -1.788174
C  -0.652287 -1.143201 -2.660366
C  -1.516768 -0.583289 0.202536
C  2.756253 -0.789872 1.123773
C  -3.722533 -0.408273 1.012752
C  -4.44166 -0.085421 -0.275655
C  -4.561334 -1.227123 1.890175
C  -4.640507 1.241466 -0.624885
C  -4.861358 -1.112388 -1.11315
C  -5.24606 1.541395 -1.838826
C  -5.485044 -0.797567 -2.3097
C  -5.671306 0.525013 -2.682717
C  -4.625688 3.837367 -1.954609
C  -3.244998 3.675955 -1.968721
C  -5.190521 5.081313 -1.709057
C  -2.43491 4.774419 -1.717113
C  -4.366995 6.172347 -1.47395
C  -2.986946 6.02393 -1.469265
H  0.902699 0.000984 -0.844871
H  -0.429382 -2.41435 0.585236
H  2.052408 -2.624052 0.291742
H  0.949611 -3.419098 -2.636801
H  0.702995 -3.850703 -0.942079
H  -0.657494 -3.823981 -2.04656
H  -1.62016 -1.587185 -2.90145
H  -0.804219 -0.080478 -2.480534
H  -0.01736 -1.235216 -3.543114
H  -3.478061 0.510483 1.55615
H  -4.314467 2.0286 0.043697
H  -4.7083 -2.148891 -0.838017
H  -5.821705 -1.588351 -2.966788
H  -6.147528 0.770072 -3.623754
H  -2.795226 2.711797 -2.171467
H  -6.267733 5.192602 -1.708361
H  -1.359945 4.647355 -1.722599
H  -4.811059 7.141397 -1.285835
H  -2.346678 6.874694 -1.277102
elementType: Br O N C H
nucrepener: 5564.99249042 hartree
twoeener: 9968.25336457 hartree
cpcmener: -0.03049280 hartree
xcener: -389.799684949970 hartree
chargesum: 0.0000000
charge: -0.081844 -0.011658 -0.012370 -0.002329 -0.264238 -0.426662 -0.324555 -0.086186 0.096246 -0.089677 -0.150359 -0.156282 -0.266495 -0.252255 0.381437 0.035715 0.402398 0.033841 -0.224804 -0.208250 -0.247299 0.295296 -0.115375 -0.230229 0.299297 -0.200733 -0.255826 -0.146100 -0.118116 -0.185917 0.117290 0.120616 0.167251 0.099680 0.092207 0.109162 0.100714 0.089173 0.102081 0.138487 0.146099 0.145601 0.159623 0.148474 0.159186 0.145262 0.157522 0.157550 0.157350
qa: -0.0818 -0.0117 -0.0124 -0.0023 -0.2642 -0.4267 -0.3246 -0.0862 0.0962 -0.0897 -0.1504 -0.1563 -0.2665 -0.2523 0.3814 0.0357 0.4024 0.0338 -0.2248 -0.2082 -0.2473 0.2953 -0.1154 -0.2302 0.2993 -0.2007 -0.2558 -0.1461 -0.1181 -0.1859 0.1173 0.1206 0.1673 0.0997 0.0922 0.1092 0.1007 0.0892 0.1021 0.1385 0.1461 0.1456 0.1596 0.1485 0.1592 0.1453 0.1575 0.1576 0.1573
va: 1.1827 1.2228 1.2250 1.2292 2.1379 2.0858 2.0912 3.1119 3.8816 3.7418 3.8571 4.0604 3.8965 3.9005 4.1968 4.3524 3.7403 3.5559 4.0732 3.9442 3.9759 3.7269 3.8983 4.0181 3.6874 3.9064 4.0083 3.8991 3.8813 3.9105 1.0433 1.0229 0.9944 1.0055 1.0041 1.0024 1.0014 1.0152 1.0043 1.0160 1.0075 1.0114 0.9890 1.0053 0.9942 1.0088 0.9912 0.9890 0.9905
dispcorr: -0.030315844 hartree
energy: -11427.175440599494
dipole: -153.57790 153.94077 0.36287 34.22860 -34.51609 -0.28749 -59.26953 57.91248 -1.35705
magnitude: 1.43384 au
magnitude: 3.64454 debye
