program: Orca
programVersion: 5.0.2
elementType: Br Br Br Br O O O N C C C C C C C C C C C C C C C C C C C C C C H H H H H H H H H H H H H H H H H H H
charge: 0
multiplicity: 1
keywords: wb97x-d3
keywords: def2-TZVPP
keywords: def2/J RIJCOSX
keywords: DEFGRID2
keywords: scfconv7
keywords: smallprint printgap noloewdin
keywords: NOSOSCF
formula: C22H19Br4NO3
InChI: InChI=1/C22H19Br4NO3/c1-21(2)17(19(23)22(24,25)26)18(21)20(28)30-16(12-27)13-7-6-10-15(11-13)29-14-8-4-3-5-9-14/h3-11,16-19H,1-2H3
49 atoms
Br 3.551539 -1.512636 -1.404801
Br 3.137002 1.165376 0.7307
Br 1.393587 -0.642875 2.614803
Br 4.327387 -1.48619 1.938105
O  -2.567871 -1.262023 0.693559
O  -1.556291 0.579989 -0.070755
O  -5.474342 2.659083 -2.439384
N  -5.277343 -2.015347 2.407978
C  0.074886 -1.790223 -1.506384
C  0.910618 -0.974409 -0.566929
C  -0.406474 -1.52328 -0.090115
C  2.197454 -1.479914 0.01744
C  0.414264 -3.228158 -1.81614
C  -0.554481 -1.069815 -2.673457
C  -1.527518 -0.599162 0.165808
C  2.733133 -0.663034 1.206215
C  -3.768742 -0.51994 0.88763
C  -4.457585 -0.218524 -0.421909
C  -4.603313 -1.370016 1.738781
C  -4.658507 1.102212 -0.791146
C  -4.843352 -1.25755 -1.261671
C  -5.23203 1.383482 -2.024712
C  -5.436165 -0.961148 -2.478191
C  -5.624306 0.356226 -2.870183
C  -4.573068 3.65856 -2.189307
C  -5.096695 4.920487 -1.944466
C  -3.198165 3.457376 -2.234712
C  -4.237056 5.990398 -1.743914
C  -2.351557 4.535592 -2.018584
C  -2.862026 5.803172 -1.772992
H  0.90808 0.087212 -0.793491
H  -0.385168 -2.395592 0.554295
H  2.0941 -2.513321 0.359477
H  1.115175 -3.292932 -2.648939
H  0.841767 -3.766538 -0.970365
H  -0.491672 -3.762436 -2.108148
H  -0.744677 -0.01604 -2.47748
H  0.109578 -1.123562 -3.537769
H  -1.500181 -1.538263 -2.952927
H  -3.574096 0.405097 1.44013
H  -4.359166 1.900987 -0.123749
H  -4.687929 -2.289867 -0.972414
H  -5.745636 -1.761821 -3.136654
H  -6.075084 0.587576 -3.827077
H  -6.170004 5.06188 -1.916831
H  -2.781613 2.478323 -2.437263
H  -4.64874 6.973626 -1.55576
H  -1.281026 4.378485 -2.0501
H  -2.193464 6.637807 -1.608478
elementType: Br O N C H
nucrepener: 5575.24712688 hartree
twoeener: 9978.49468898 hartree
cpcmener: -0.03064101 hartree
xcener: -389.799409894977 hartree
chargesum: 0.0000000
charge: -0.082309 -0.011965 -0.012592 -0.001947 -0.264560 -0.427532 -0.326792 -0.086312 0.097471 -0.088164 -0.153739 -0.158747 -0.267010 -0.250707 0.384376 0.036767 0.404009 0.029732 -0.224993 -0.195009 -0.241151 0.278112 -0.118919 -0.223386 0.289386 -0.249851 -0.190402 -0.120941 -0.152233 -0.183528 0.118259 0.120542 0.167404 0.099180 0.092530 0.109440 0.086727 0.102361 0.101430 0.138032 0.146033 0.145830 0.159620 0.148723 0.145506 0.159004 0.157707 0.157229 0.157378
qa: -0.0823 -0.0120 -0.0126 -0.0019 -0.2646 -0.4275 -0.3268 -0.0863 0.0975 -0.0882 -0.1537 -0.1587 -0.2670 -0.2507 0.3844 0.0368 0.4040 0.0297 -0.2250 -0.1950 -0.2412 0.2781 -0.1189 -0.2234 0.2894 -0.2499 -0.1904 -0.1209 -0.1522 -0.1835 0.1183 0.1205 0.1674 0.0992 0.0925 0.1094 0.0867 0.1024 0.1014 0.1380 0.1460 0.1458 0.1596 0.1487 0.1455 0.1590 0.1577 0.1572 0.1574
va: 1.1822 1.2225 1.2250 1.2297 2.1384 2.0842 2.0872 3.1122 3.8785 3.7418 3.8579 4.0619 3.8963 3.9002 4.1948 4.3539 3.7375 3.5555 4.0721 3.9392 3.9752 3.7378 3.9002 4.0189 3.6950 4.0035 3.8969 3.8855 3.9054 3.9078 1.0419 1.0235 0.9942 1.0057 1.0038 1.0023 1.0159 1.0045 1.0010 1.0161 1.0086 1.0108 0.9891 1.0048 1.0085 0.9921 0.9890 0.9915 0.9904
dispcorr: -0.030497448 hartree
energy: -11427.175740950064
dipole: -151.40695 151.83568 0.42873 28.64223 -28.94594 -0.30371 -65.16123 63.77132 -1.38991
magnitude: 1.48590 au
magnitude: 3.77686 debye
