program: Orca
programVersion: 5.0.2
elementType: Br Br Br Br O O O N C C C C C C C C C C C C C C C C C C C C C C H H H H H H H H H H H H H H H H H H H
charge: 0
multiplicity: 1
keywords: wb97x-d3
keywords: def2-TZVPP
keywords: def2/J RIJCOSX
keywords: DEFGRID2
keywords: scfconv7
keywords: smallprint printgap noloewdin
keywords: NOSOSCF
formula: C22H19Br4NO3
InChI: InChI=1/C22H19Br4NO3/c1-21(2)17(19(23)22(24,25)26)18(21)20(28)30-16(12-27)13-7-6-10-15(11-13)29-14-8-4-3-5-9-14/h3-11,16-19H,1-2H3
49 atoms
Br 3.678152 -0.855565 -1.379838
Br 3.019696 0.582208 1.703686
Br 0.898303 -1.657334 2.259223
Br 3.864492 -2.442466 1.647779
O  -2.529412 -0.965314 0.277621
O  -1.520879 1.019588 0.052857
O  -5.506716 3.248253 -1.905893
N  -4.706834 -2.13677 2.451364
C  0.241347 -0.563911 -2.024359
C  0.960505 -0.413042 -0.723563
C  -0.444281 -0.968583 -0.730456
C  2.097903 -1.296098 -0.301712
C  0.564974 -1.701176 -2.962725
C  -0.155488 0.69976 -2.747928
C  -1.518503 -0.173236 -0.110041
C  2.456367 -1.193246 1.191039
C  -3.661332 -0.333031 0.87825
C  -4.626414 0.144218 -0.177846
C  -4.247539 -1.35206 1.75025
C  -4.644672 1.494091 -0.49988
C  -5.426304 -0.757451 -0.871227
C  -5.445108 1.934863 -1.545886
C  -6.249024 -0.296008 -1.886299
C  -6.253607 1.045335 -2.238518
C  -4.373552 4.018486 -1.894674
C  -3.140877 3.534733 -2.31895
C  -4.515867 5.338677 -1.492292
C  -2.045719 4.386438 -2.323245
C  -3.413874 6.181637 -1.514864
C  -2.173958 5.709657 -1.922404
H  1.041198 0.616681 -0.38962
H  -0.546052 -2.040315 -0.602187
H  1.874406 -2.346021 -0.511102
H  -0.306987 -1.930918 -3.577553
H  1.378549 -1.427403 -3.635154
H  0.846397 -2.620575 -2.44928
H  -0.311514 1.545043 -2.081571
H  0.634153 0.978136 -3.447932
H  -1.068788 0.544648 -3.32528
H  -3.351204 0.49873 1.518063
H  -4.032957 2.191712 0.057777
H  -5.418184 -1.812051 -0.624083
H  -6.883295 -0.989453 -2.422501
H  -6.882459 1.402047 -3.044553
H  -3.02607 2.508992 -2.646858
H  -5.483163 5.702741 -1.169054
H  -1.085514 4.008034 -2.650592
H  -3.52801 7.211964 -1.20342
H  -1.315002 6.367623 -1.930455
elementType: Br O N C H
nucrepener: 5608.03063942 hartree
cpcmener: -0.02978793 hartree
xcener: -389.801178349304 hartree
chargesum: -0.0000000
charge: -0.079121 -0.011617 -0.012164 -0.001234 -0.267943 -0.440992 -0.327334 -0.085894 0.107012 -0.095121 -0.156941 -0.155739 -0.260241 -0.268077 0.413936 0.037650 0.397420 -0.004728 -0.221916 -0.172490 -0.205511 0.266425 -0.126891 -0.224694 0.295293 -0.210276 -0.248548 -0.137121 -0.120333 -0.187876 0.121352 0.115629 0.165071 0.109426 0.099043 0.091442 0.080844 0.102324 0.106964 0.136245 0.144623 0.141782 0.159676 0.148502 0.162584 0.145051 0.159773 0.157253 0.157483
qa: -0.0791 -0.0116 -0.0122 -0.0012 -0.2679 -0.4410 -0.3273 -0.0859 0.1070 -0.0951 -0.1569 -0.1557 -0.2602 -0.2681 0.4139 0.0376 0.3974 -0.0047 -0.2219 -0.1725 -0.2055 0.2664 -0.1269 -0.2247 0.2953 -0.2103 -0.2485 -0.1371 -0.1203 -0.1879 0.1214 0.1156 0.1651 0.1094 0.0990 0.0914 0.0808 0.1023 0.1070 0.1362 0.1446 0.1418 0.1597 0.1485 0.1626 0.1451 0.1598 0.1573 0.1575
va: 1.1849 1.2232 1.2283 1.2307 2.1292 2.0677 2.0890 3.1116 3.8581 3.7306 3.9038 4.0638 3.9006 3.9061 4.1318 4.3501 3.7495 3.6507 4.0601 3.9116 3.9937 3.7492 3.9120 4.0249 3.7062 3.9031 4.0090 3.8838 3.8880 3.9280 1.0412 1.0260 0.9947 1.0025 1.0055 1.0044 1.0169 1.0049 0.9972 1.0183 1.0172 1.0089 0.9897 1.0048 0.9884 1.0084 0.9895 0.9889 0.9911
dispcorr: -0.031114944 hartree
energy: -11427.176347582692
dipole: -142.12418 142.31844 0.19425 59.77883 -59.54371 0.23512 -70.77100 68.75172 -2.01927
magnitude: 2.04218 au
magnitude: 5.19080 debye
