program: Orca
programVersion: 5.0.2
elementType: Br Br Br Br O O O N C C C C C C C C C C C C C C C C C C C C C C H H H H H H H H H H H H H H H H H H H
charge: 0
multiplicity: 1
keywords: wb97x-d3
keywords: def2-TZVPP
keywords: def2/J RIJCOSX
keywords: DEFGRID2
keywords: scfconv7
keywords: smallprint printgap noloewdin
keywords: NOSOSCF
formula: C22H19Br4NO3
InChI: InChI=1/C22H19Br4NO3/c1-21(2)17(19(23)22(24,25)26)18(21)20(28)30-16(12-27)13-7-6-10-15(11-13)29-14-8-4-3-5-9-14/h3-11,16-19H,1-2H3
49 atoms
Br 3.787175 0.149698 1.212175
Br 2.180271 -2.898584 1.644776
Br 0.885223 -2.574625 -1.195349
Br 3.992091 -2.548044 -0.905848
O  -2.260328 -0.05191 -0.973064
O  -1.85595 -0.402253 1.195323
O  -5.322252 4.027905 -0.131876
N  -4.526614 -0.951275 -3.190755
C  0.606764 1.50327 0.585306
C  1.021985 0.070443 0.676498
C  -0.125767 0.448815 -0.227467
C  2.296135 -0.456559 0.086422
C  1.408146 2.493674 -0.224958
C  -0.030101 2.119117 1.805961
C  -1.473184 -0.040208 0.113771
C  2.345272 -1.988592 -0.051811
C  -3.589268 -0.522226 -0.789575
C  -4.469268 0.471703 -0.067762
C  -4.096466 -0.76101 -2.143082
C  -4.453537 1.806285 -0.45228
C  -5.295876 0.03858 0.958476
C  -5.265817 2.710711 0.217025
C  -6.120148 0.951242 1.600487
C  -6.103661 2.288919 1.241222
C  -4.175318 4.69698 -0.467286
C  -4.254359 5.603838 -1.514182
C  -2.991016 4.529668 0.240479
C  -3.136002 6.352039 -1.853932
C  -1.878606 5.277644 -0.117316
C  -1.943673 6.189353 -1.1628
H  0.727314 -0.405971 1.606253
H  0.078545 0.493897 -1.291089
H  2.470292 -0.035517 -0.907477
H  1.852439 2.062414 -1.121887
H  0.762818 3.311981 -0.550257
H  2.210046 2.925541 0.374762
H  0.741289 2.583045 2.423083
H  -0.738084 2.899352 1.520513
H  -0.555381 1.398568 2.428808
H  -3.595969 -1.481508 -0.261041
H  -3.819139 2.137723 -1.266333
H  -5.296453 -1.002329 1.255722
H  -6.768245 0.622153 2.401874
H  -6.735648 3.005672 1.75031
H  -5.185331 5.725401 -2.053793
H  -2.931046 3.831447 1.06647
H  -3.200029 7.06076 -2.669552
H  -0.956323 5.150898 0.435368
H  -1.072437 6.770913 -1.433813
elementType: Br O N C H
nucrepener: 5610.61043547 hartree
cpcmener: -0.03182820 hartree
xcener: -389.801860779579 hartree
chargesum: 0.0000000
charge: -0.080085 -0.010106 -0.011759 -0.002285 -0.278452 -0.429147 -0.328522 -0.085400 0.106921 -0.099117 -0.138567 -0.155177 -0.262044 -0.257262 0.378654 0.036248 0.416960 0.020072 -0.227772 -0.187568 -0.198011 0.227343 -0.116697 -0.223868 0.274452 -0.248549 -0.178070 -0.115831 -0.151271 -0.193864 0.119562 0.117852 0.167489 0.092378 0.104095 0.100461 0.103629 0.081753 0.099547 0.143664 0.148077 0.145185 0.158898 0.149093 0.145944 0.160821 0.157868 0.165057 0.157402
qa: -0.0801 -0.0101 -0.0118 -0.0023 -0.2785 -0.4291 -0.3285 -0.0854 0.1069 -0.0991 -0.1386 -0.1552 -0.2620 -0.2573 0.3787 0.0362 0.4170 0.0201 -0.2278 -0.1876 -0.1980 0.2273 -0.1167 -0.2239 0.2745 -0.2485 -0.1781 -0.1158 -0.1513 -0.1939 0.1196 0.1179 0.1675 0.0924 0.1041 0.1005 0.1036 0.0818 0.0995 0.1437 0.1481 0.1452 0.1589 0.1491 0.1459 0.1608 0.1579 0.1651 0.1574
va: 1.1835 1.2246 1.2287 1.2294 2.1219 2.0856 2.0813 3.1132 3.8495 3.7403 3.8812 4.0653 3.9058 3.8978 4.1579 4.3456 3.7198 3.6052 4.0818 3.9324 3.9764 3.7777 3.9034 4.0084 3.7300 4.0108 3.8841 3.8855 3.8741 3.9347 1.0452 1.0248 0.9936 1.0059 1.0062 1.0047 1.0042 1.0083 1.0202 1.0162 1.0155 1.0031 0.9893 1.0042 1.0079 0.9929 0.9884 0.9846 0.9919
dispcorr: -0.031622653 hartree
energy: -11427.176786206304
dipole: -130.93206 131.53609 0.60403 116.93946 -115.51266 1.42681 -3.48819 4.30810 0.81991
magnitude: 1.75296 au
magnitude: 4.45567 debye
