program: Orca
programVersion: 5.0.2
elementType: Br Br Br Br O O O N C C C C C C C C C C C C C C C C C C C C C C H H H H H H H H H H H H H H H H H H H
charge: 0
multiplicity: 1
keywords: wb97x-d3
keywords: def2-TZVPP
keywords: def2/J RIJCOSX
keywords: DEFGRID2
keywords: scfconv7
keywords: smallprint printgap noloewdin
keywords: NOSOSCF
formula: C22H19Br4NO3
InChI: InChI=1/C22H19Br4NO3/c1-21(2)17(19(23)22(24,25)26)18(21)20(28)30-16(12-27)13-7-6-10-15(11-13)29-14-8-4-3-5-9-14/h3-11,16-19H,1-2H3
49 atoms
Br 3.712114 -1.213489 -1.06054
Br 1.069313 1.037615 -1.047372
Br 0.464488 0.248182 1.927527
Br 3.28132 1.360535 1.167678
O  -1.577941 -2.84589 -0.238251
O  -1.649643 -3.066327 1.981766
O  -2.829812 1.978436 -1.445812
N  -3.727219 -3.503287 -2.657844
C  1.380014 -3.639396 -0.057952
C  1.225936 -2.153298 -0.109789
C  0.466051 -2.944164 0.934609
C  2.306494 -1.200117 0.311016
C  2.609724 -4.265296 0.558098
C  0.84144 -4.443835 -1.215667
C  -1.008455 -2.968162 0.967489
C  1.827961 0.243595 0.540402
C  -2.99507 -2.719551 -0.276188
C  -3.423259 -1.29553 -0.020276
C  -3.387328 -3.155426 -1.617611
C  -2.915311 -0.277848 -0.820264
C  -4.2924 -1.005164 1.019673
C  -3.299177 1.031027 -0.584085
C  -4.672999 0.311966 1.24194
C  -4.187233 1.333951 0.443679
C  -2.336258 3.170163 -0.994368
C  -2.388188 4.232505 -1.888058
C  -1.751577 3.328372 0.25578
C  -1.84872 5.457578 -1.526846
C  -1.224432 4.563417 0.606317
C  -1.267678 5.631937 -0.27771
H  0.631753 -1.806406 -0.948741
H  0.86962 -2.916051 1.940334
H  2.784064 -1.533381 1.236064
H  2.373765 -5.271774 0.907864
H  3.411403 -4.351922 -0.175932
H  2.99387 -3.711561 1.414792
H  0.032992 -3.952873 -1.751711
H  1.644038 -4.618442 -1.934427
H  0.483923 -5.418321 -0.878594
H  -3.474727 -3.396622 0.437196
H  -2.234794 -0.494587 -1.635614
H  -4.676903 -1.798571 1.64771
H  -5.360786 0.545389 2.043748
H  -4.50293 2.354876 0.618383
H  -2.841916 4.095228 -2.86181
H  -1.693321 2.504323 0.95393
H  -1.888109 6.281136 -2.228269
H  -0.768159 4.681906 1.580775
H  -0.850723 6.590188 0.002573
elementType: Br O N C H
nucrepener: 5983.03483946 hartree
cpcmener: -0.03012283 hartree
xcener: -389.802664834939 hartree
chargesum: -0.0000000
charge: -0.080018 -0.014104 -0.020135 -0.003690 -0.270067 -0.426862 -0.320134 -0.084400 0.111740 -0.118344 -0.129761 -0.151382 -0.265524 -0.258240 0.375877 0.060043 0.389495 0.025868 -0.232160 -0.239058 -0.181301 0.244435 -0.125534 -0.179968 0.341318 -0.266321 -0.221742 -0.116593 -0.150442 -0.190507 0.127362 0.116574 0.167413 0.108953 0.097640 0.092299 0.091233 0.096261 0.104989 0.140600 0.133530 0.147241 0.160949 0.159065 0.144798 0.139086 0.156848 0.155803 0.156868
qa: -0.0800 -0.0141 -0.0201 -0.0037 -0.2701 -0.4269 -0.3201 -0.0844 0.1117 -0.1183 -0.1298 -0.1514 -0.2655 -0.2582 0.3759 0.0600 0.3895 0.0259 -0.2322 -0.2391 -0.1813 0.2444 -0.1255 -0.1800 0.3413 -0.2663 -0.2217 -0.1166 -0.1504 -0.1905 0.1274 0.1166 0.1674 0.1090 0.0976 0.0923 0.0912 0.0963 0.1050 0.1406 0.1335 0.1472 0.1609 0.1591 0.1448 0.1391 0.1568 0.1558 0.1569
va: 1.1844 1.2199 1.2211 1.2303 2.1232 2.0801 2.0742 3.1070 3.8495 3.7373 3.9041 4.0546 3.9089 3.9067 4.1788 4.3021 3.7532 3.6181 4.0687 4.0397 3.9666 3.7891 3.8935 3.9239 3.5968 4.0114 3.8781 3.8840 3.9263 3.9164 1.0283 1.0217 0.9939 1.0021 1.0063 1.0045 1.0132 1.0025 1.0003 1.0164 1.0267 1.0044 0.9898 0.9941 1.0096 1.0070 0.9890 0.9919 0.9904
dispcorr: -0.034658982 hartree
energy: -11427.177321501882
dipole: -87.06544 87.66900 0.60356 -25.39415 25.46772 0.07357 -8.34955 9.87347 1.52392
magnitude: 1.64074 au
magnitude: 4.17043 debye
