program: Orca
programVersion: 5.0.2
elementType: Br Br Br Br O O O N C C C C C C C C C C C C C C C C C C C C C C H H H H H H H H H H H H H H H H H H H
charge: 0
multiplicity: 1
keywords: wb97x-d3
keywords: def2-TZVPP
keywords: def2/J RIJCOSX
keywords: DEFGRID2
keywords: scfconv7
keywords: smallprint printgap noloewdin
keywords: NOSOSCF
formula: C22H19Br4NO3
InChI: InChI=1/C22H19Br4NO3/c1-21(2)17(19(23)22(24,25)26)18(21)20(28)30-16(12-27)13-7-6-10-15(11-13)29-14-8-4-3-5-9-14/h3-11,16-19H,1-2H3
49 atoms
Br 3.788918 -2.643775 1.226007
Br 3.072498 -1.616119 -2.002503
Br 1.316883 0.708752 -0.840006
Br 4.334603 0.49726 -0.039771
O  -2.295579 -0.685799 0.424783
O  -1.48731 -2.299303 -0.890043
O  -6.190527 3.390301 0.642347
N  -2.840402 0.492669 -2.679382
C  0.31346 -2.835278 1.689081
C  1.072456 -2.174007 0.585147
C  -0.243194 -1.583743 1.029489
C  2.338697 -1.396054 0.787421
C  0.732692 -2.67158 3.1302
C  -0.283752 -4.189544 1.397865
C  -1.371453 -1.598567 0.081749
C  2.748386 -0.543686 -0.427715
C  -3.462284 -0.612769 -0.392156
C  -4.512214 0.144589 0.381722
C  -3.114506 0.010678 -1.673648
C  -4.816793 1.472529 0.116432
C  -5.16529 -0.540221 1.400918
C  -5.786933 2.112499 0.880904
C  -6.126803 0.11145 2.154468
C  -6.440177 1.437599 1.902439
C  -5.324421 4.324203 0.137092
C  -5.793094 5.135864 -0.885492
C  -4.054313 4.509794 0.668743
C  -4.98208 6.148876 -1.377212
C  -3.250231 5.518686 0.158802
C  -3.707648 6.341216 -0.862396
H  1.028381 -2.720491 -0.351518
H  -0.198522 -0.701008 1.65773
H  2.254428 -0.723531 1.645213
H  -0.131413 -2.806709 3.783089
H  1.472644 -3.423841 3.405358
H  1.1516 -1.689099 3.349213
H  0.431259 -4.968211 1.669038
H  -1.186602 -4.349789 1.989689
H  -0.53661 -4.332066 0.349363
H  -3.834827 -1.617277 -0.615024
H  -4.318995 2.004024 -0.685808
H  -4.929459 -1.578388 1.598998
H  -6.640415 -0.41658 2.946802
H  -7.196141 1.947028 2.486571
H  -6.787039 4.980305 -1.286246
H  -3.693691 3.883833 1.475723
H  -5.3504 6.785181 -2.171618
H  -2.260723 5.665906 0.572052
H  -3.076182 7.129264 -1.251085
elementType: Br O N C H
nucrepener: 5526.33575332 hartree
twoeener: 9930.67956193 hartree
cpcmener: -0.03217685 hartree
xcener: -389.798232516821 hartree
chargesum: 0.0000000
charge: -0.080985 -0.011945 -0.014452 -0.001588 -0.264421 -0.429894 -0.323843 -0.083348 0.092958 -0.099572 -0.138726 -0.150532 -0.259946 -0.261656 0.388328 0.043841 0.419115 -0.038547 -0.227639 -0.146109 -0.227511 0.256969 -0.124804 -0.218588 0.277136 -0.243262 -0.193835 -0.120990 -0.138886 -0.182199 0.117894 0.118177 0.165585 0.108385 0.099760 0.091092 0.100054 0.103272 0.094645 0.134553 0.140066 0.146569 0.158180 0.147861 0.146276 0.157231 0.157934 0.159119 0.158278
qa: -0.0810 -0.0119 -0.0145 -0.0016 -0.2644 -0.4299 -0.3238 -0.0833 0.0930 -0.0996 -0.1387 -0.1505 -0.2599 -0.2617 0.3883 0.0438 0.4191 -0.0385 -0.2276 -0.1461 -0.2275 0.2570 -0.1248 -0.2186 0.2771 -0.2433 -0.1938 -0.1210 -0.1389 -0.1822 0.1179 0.1182 0.1656 0.1084 0.0998 0.0911 0.1001 0.1033 0.0946 0.1346 0.1401 0.1466 0.1582 0.1479 0.1463 0.1572 0.1579 0.1591 0.1583
va: 1.1827 1.2235 1.2284 1.2301 2.1339 2.0792 2.0840 3.1064 3.8716 3.7378 3.8999 4.0686 3.9014 3.8993 4.1468 4.3435 3.7169 3.7743 4.0248 3.8991 3.9740 3.8060 3.9086 4.0018 3.6967 4.0137 3.9219 3.8834 3.8881 3.9066 1.0468 1.0248 0.9943 1.0030 1.0054 1.0038 1.0025 1.0001 1.0176 1.0129 1.0146 1.0019 0.9899 1.0061 1.0076 0.9964 0.9892 0.9900 0.9904
dispcorr: -0.028660061 hartree
energy: -11427.174631297252
dipole: -156.83614 155.92235 -0.91379 31.30520 -31.71216 -0.40696 34.21114 -31.26531 2.94583
magnitude: 3.11103 au
magnitude: 7.90761 debye
