program: Orca
programVersion: 5.0.2
elementType: Br Br Br Br O O O N C C C C C C C C C C C C C C C C C C C C C C H H H H H H H H H H H H H H H H H H H
charge: 0
multiplicity: 1
keywords: wb97x-d3
keywords: def2-TZVPP
keywords: def2/J RIJCOSX
keywords: DEFGRID2
keywords: scfconv7
keywords: smallprint printgap noloewdin
keywords: NOSOSCF
formula: C22H19Br4NO3
InChI: InChI=1/C22H19Br4NO3/c1-21(2)17(19(23)22(24,25)26)18(21)20(28)30-16(12-27)13-7-6-10-15(11-13)29-14-8-4-3-5-9-14/h3-11,16-19H,1-2H3
49 atoms
Br 4.014675 -2.560908 1.345124
Br 1.854313 -3.899489 -0.993571
Br 1.060746 -0.993022 -1.88922
Br 4.045028 -1.891358 -2.029023
O  -1.466001 0.680057 0.615993
O  -1.571355 -1.406417 1.398352
O  -5.600085 4.592036 0.99476
N  -3.470582 -1.070678 -1.496311
C  1.29243 -0.700985 2.555569
C  1.404791 -1.490377 1.291997
C  0.532047 -0.256602 1.318412
C  2.635667 -1.501024 0.435249
C  2.398754 0.229834 2.992518
C  0.575551 -1.344698 3.715822
C  -0.919887 -0.426429 1.14411
C  2.420592 -2.051969 -0.985683
C  -2.865359 0.661232 0.370773
C  -3.276807 2.040314 -0.076799
C  -3.186429 -0.326088 -0.669301
C  -4.221927 2.732653 0.663375
C  -2.710882 2.61342 -1.210741
C  -4.619535 4.000645 0.2578
C  -3.114278 3.879842 -1.600236
C  -4.070635 4.580302 -0.877817
C  -5.620851 5.948294 1.181643
C  -6.861624 6.567705 1.138802
C  -4.47258 6.675198 1.471755
C  -6.95334 7.928858 1.391452
C  -4.578697 8.038002 1.710253
C  -5.814291 8.670696 1.671648
H  0.862472 -2.430619 1.315292
H  0.935013 0.63479 0.851396
H  3.048718 -0.493427 0.336837
H  3.141156 -0.303694 3.587101
H  2.91451 0.711372 2.16175
H  1.98575 1.023849 3.616867
H  1.299189 -1.86699 4.343945
H  0.085758 -0.590621 4.334248
H  -0.17394 -2.071065 3.409805
H  -3.417075 0.378064 1.27237
H  -4.659646 2.291366 1.550851
H  -1.971303 2.078555 -1.793988
H  -2.688325 4.330597 -2.486796
H  -4.384518 5.561569 -1.210391
H  -7.747467 5.985612 0.917409
H  -3.504939 6.191198 1.518919
H  -7.922477 8.409949 1.362448
H  -3.685009 8.605657 1.935591
H  -5.888667 9.733107 1.862766
elementType: Br O N C H
nucrepener: 5416.27776812 hartree
twoeener: 9820.26368301 hartree
cpcmener: -0.03346296 hartree
xcener: -389.800586920574 hartree
chargesum: -0.0000000
charge: -0.078686 -0.008860 -0.015885 -0.003328 -0.267995 -0.430265 -0.324675 -0.082855 0.098667 -0.095715 -0.140238 -0.157034 -0.261764 -0.262163 0.382442 0.041973 0.421066 0.012024 -0.241772 -0.209316 -0.217191 0.250506 -0.147837 -0.168264 0.281349 -0.246335 -0.193054 -0.120887 -0.144241 -0.182912 0.120771 0.117943 0.167179 0.099960 0.090976 0.109328 0.098657 0.103626 0.095125 0.127714 0.137149 0.148922 0.159779 0.157677 0.146271 0.157277 0.157284 0.159395 0.158209
qa: -0.0787 -0.0089 -0.0159 -0.0033 -0.2680 -0.4303 -0.3247 -0.0829 0.0987 -0.0957 -0.1402 -0.1570 -0.2618 -0.2622 0.3824 0.0420 0.4211 0.0120 -0.2418 -0.2093 -0.2172 0.2505 -0.1478 -0.1683 0.2813 -0.2463 -0.1931 -0.1209 -0.1442 -0.1829 0.1208 0.1179 0.1672 0.1000 0.0910 0.1093 0.0987 0.1036 0.0951 0.1277 0.1371 0.1489 0.1598 0.1577 0.1463 0.1573 0.1573 0.1594 0.1582
va: 1.1857 1.2255 1.2289 1.2292 2.1601 2.0749 2.0783 3.1093 3.8659 3.7354 3.9064 4.0661 3.9017 3.8985 4.1622 4.3438 3.7259 3.7153 4.0188 4.0383 3.9908 3.7936 3.9314 3.9138 3.6894 4.0083 3.9144 3.8859 3.8924 3.9040 1.0432 1.0231 0.9937 1.0057 1.0042 1.0025 1.0021 0.9996 1.0182 1.0203 1.0167 1.0062 0.9912 0.9950 1.0081 0.9966 0.9895 0.9903 0.9904
dispcorr: -0.028407252 hartree
energy: -11427.174801232979
dipole: -130.89366 131.61430 0.72064 132.80081 -129.50739 3.29342 59.85396 -58.28348 1.57048
magnitude: 3.71919 au
magnitude: 9.45343 debye
