program: Orca
programVersion: 5.0.2
elementType: Br Br Br Br O O O N C C C C C C C C C C C C C C C C C C C C C C H H H H H H H H H H H H H H H H H H H
charge: 0
multiplicity: 1
keywords: wb97x-d3
keywords: def2-TZVPP
keywords: def2/J RIJCOSX
keywords: DEFGRID2
keywords: scfconv7
keywords: smallprint printgap noloewdin
keywords: NOSOSCF
formula: C22H19Br4NO3
InChI: InChI=1/C22H19Br4NO3/c1-21(2)17(19(23)22(24,25)26)18(21)20(28)30-16(12-27)13-7-6-10-15(11-13)29-14-8-4-3-5-9-14/h3-11,16-19H,1-2H3
49 atoms
Br 4.037869 -0.812608 1.419584
Br 2.005903 -3.600405 1.579358
Br 0.780548 -2.828248 -1.207409
Br 3.860613 -3.319558 -0.936868
O  -1.897823 0.211823 -0.814127
O  -1.638676 -0.28242 1.351915
O  -4.410325 4.693083 -1.495349
N  -4.147315 -0.669268 -3.056952
C  1.162644 1.083649 0.915591
C  1.30836 -0.403302 0.872266
C  0.26617 0.262802 0.003679
C  2.489904 -1.080332 0.240898
C  2.143867 1.983341 0.20251
C  0.634046 1.689526 2.191425
C  -1.160161 0.027657 0.292222
C  2.311944 -2.582919 -0.033728
C  -3.308111 0.055196 -0.690913
C  -3.976777 1.333008 -0.246395
C  -3.766977 -0.346723 -2.022421
C  -3.872887 2.473165 -1.033372
C  -4.677197 1.367362 0.950876
C  -4.497094 3.64503 -0.631541
C  -5.29511 2.546911 1.341951
C  -5.218204 3.687089 0.558066
C  -4.493178 5.99071 -1.06615
C  -5.257917 6.857082 -1.834308
C  -3.788585 6.453716 0.038122
C  -5.312191 8.20177 -1.496693
C  -3.863919 7.798513 0.371988
C  -4.621435 8.677277 -0.39089
H  0.91522 -0.906498 1.750221
H  0.49945 0.363064 -1.050213
H  2.750588 -0.605494 -0.708694
H  2.995126 2.216192 0.842942
H  2.525726 1.560748 -0.726996
H  1.656369 2.926027 -0.052078
H  0.090466 2.613797 1.98774
H  -0.024093 1.023857 2.744669
H  1.472183 1.93656 2.845578
H  -3.55714 -0.759093 -0.003524
H  -3.326236 2.459844 -1.969871
H  -4.750491 0.481609 1.568453
H  -5.852964 2.579699 2.26846
H  -5.724524 4.590367 0.873185
H  -5.796668 6.481901 -2.695585
H  -3.181026 5.781993 0.631758
H  -5.90307 8.877649 -2.101525
H  -3.316691 8.160346 1.232958
H  -4.668966 9.725717 -0.127577
elementType: Br O N C H
nucrepener: 5425.69709098 hartree
twoeener: 9829.17670659 hartree
cpcmener: -0.03009334 hartree
xcener: -389.797767325626 hartree
chargesum: 0.0000000
charge: -0.081404 -0.011632 -0.011858 -0.001124 -0.276817 -0.437427 -0.321252 -0.086404 0.098727 -0.092321 -0.157332 -0.158075 -0.259703 -0.264413 0.402938 0.037166 0.418384 0.004078 -0.230104 -0.240939 -0.182703 0.265825 -0.135538 -0.192482 0.293036 -0.247720 -0.208585 -0.120054 -0.140338 -0.182765 0.120227 0.117091 0.167810 0.098103 0.091246 0.109564 0.104301 0.096228 0.098791 0.136313 0.135897 0.145935 0.160439 0.158096 0.146207 0.159132 0.157281 0.159754 0.158422
qa: -0.0814 -0.0116 -0.0119 -0.0011 -0.2768 -0.4374 -0.3213 -0.0864 0.0987 -0.0923 -0.1573 -0.1581 -0.2597 -0.2644 0.4029 0.0372 0.4184 0.0041 -0.2301 -0.2409 -0.1827 0.2658 -0.1355 -0.1925 0.2930 -0.2477 -0.2086 -0.1201 -0.1403 -0.1828 0.1202 0.1171 0.1678 0.0981 0.0912 0.1096 0.1043 0.0962 0.0988 0.1363 0.1359 0.1459 0.1604 0.1581 0.1462 0.1591 0.1573 0.1598 0.1584
va: 1.1829 1.2225 1.2278 1.2294 2.1278 2.0772 2.0881 3.1123 3.8553 3.7404 3.9031 4.0694 3.9012 3.8993 4.1481 4.3467 3.7238 3.6478 4.0770 4.0782 3.9594 3.7941 3.9175 3.9180 3.6773 4.0150 3.9267 3.8836 3.8879 3.9071 1.0425 1.0253 0.9934 1.0063 1.0043 1.0026 0.9997 1.0189 1.0025 1.0178 1.0259 1.0066 0.9909 0.9953 1.0082 0.9961 0.9895 0.9901 0.9904
dispcorr: -0.028483033 hartree
energy: -11427.174332439823
dipole: -130.46728 130.66480 0.19752 153.89497 -151.62949 2.26548 -1.11150 2.44660 1.33510
magnitude: 2.63703 au
magnitude: 6.70279 debye
