program: Orca
programVersion: 5.0.2
elementType: Br Br Br Br O O O N C C C C C C C C C C C C C C C C C C C C C C H H H H H H H H H H H H H H H H H H H
charge: 0
multiplicity: 1
keywords: wb97x-d3
keywords: def2-TZVPP
keywords: def2/J RIJCOSX
keywords: DEFGRID2
keywords: scfconv7
keywords: smallprint printgap noloewdin
keywords: NOSOSCF
formula: C22H19Br4NO3
InChI: InChI=1/C22H19Br4NO3/c1-21(2)17(19(23)22(24,25)26)18(21)20(28)30-16(12-27)13-7-6-10-15(11-13)29-14-8-4-3-5-9-14/h3-11,16-19H,1-2H3
49 atoms
Br 3.243743 -3.069291 -0.939473
Br 3.781812 0.239531 -0.068172
Br 1.836891 -0.128287 2.367099
Br 4.358249 -1.959247 2.103807
O  -2.14261 -0.100472 1.011459
O  -0.988762 0.698268 -0.73153
O  -5.546185 2.893085 -2.839818
N  -4.279451 1.164383 3.200548
C  -0.171296 -2.36359 -0.923645
C  0.953434 -1.516253 -0.41881
C  -0.397351 -1.411537 0.238055
C  2.117927 -2.092339 0.331381
C  -0.246907 -3.833362 -0.578783
C  -0.719502 -2.053904 -2.295304
C  -1.166821 -0.16019 0.085231
C  2.970495 -1.065055 1.095304
C  -3.020628 1.008808 0.916102
C  -4.014525 0.862077 -0.21286
C  -3.716082 1.077038 2.203601
C  -4.299642 1.963213 -1.002132
C  -4.648672 -0.352976 -0.437859
C  -5.242584 1.855037 -2.017659
C  -5.565745 -0.454997 -1.471013
C  -5.873439 0.64319 -2.258324
C  -5.572136 4.164865 -2.335287
C  -4.945593 5.162075 -3.065987
C  -6.244473 4.465508 -1.157178
C  -4.997798 6.472654 -2.614707
C  -6.278677 5.77721 -0.712157
C  -5.657943 6.785275 -1.436193
H  1.206592 -0.683132 -1.067186
H  -0.52507 -1.897789 1.198587
H  1.786721 -2.832849 1.063571
H  0.324622 -4.42869 -1.290921
H  0.124013 -4.064464 0.419715
H  -1.284092 -4.168976 -0.619239
H  -0.162833 -2.619861 -3.043506
H  -1.768102 -2.347272 -2.367948
H  -0.648893 -1.000798 -2.555956
H  -2.455966 1.938727 0.788611
H  -3.78389 2.90074 -0.833957
H  -4.434998 -1.211206 0.185385
H  -6.062753 -1.39754 -1.657038
H  -6.598189 0.568934 -3.05809
H  -4.427619 4.909037 -3.981645
H  -6.739786 3.685362 -0.593077
H  -4.510884 7.251179 -3.18677
H  -6.801541 6.01134 0.205608
H  -5.69185 7.807483 -1.084923
nucrepener: 5461.90187922 hartree
twoeener: 9865.34407444 hartree
xcener: -389.812009392042 hartree
chargesum: 0.0000000
charge: -0.059991 0.002526 -0.006527 0.008609 -0.263713 -0.354508 -0.297867 0.000708 0.074482 -0.067184 -0.162495 -0.180841 -0.245909 -0.240550 0.336969 0.033583 0.305866 0.058859 -0.251513 -0.124675 -0.211179 0.193695 -0.092413 -0.184934 0.222022 -0.200789 -0.153442 -0.094298 -0.116890 -0.139352 0.121551 0.103484 0.149055 0.101412 0.076300 0.101978 0.097240 0.087630 0.101634 0.122279 0.113989 0.125824 0.128811 0.130375 0.127863 0.136465 0.127189 0.131022 0.127650
qa: -0.0600 0.0025 -0.0065 0.0086 -0.2637 -0.3545 -0.2979 0.0007 0.0745 -0.0672 -0.1625 -0.1808 -0.2459 -0.2406 0.3370 0.0336 0.3059 0.0589 -0.2515 -0.1247 -0.2112 0.1937 -0.0924 -0.1849 0.2220 -0.2008 -0.1534 -0.0943 -0.1169 -0.1394 0.1216 0.1035 0.1491 0.1014 0.0763 0.1020 0.0972 0.0876 0.1016 0.1223 0.1140 0.1258 0.1288 0.1304 0.1279 0.1365 0.1272 0.1310 0.1276
va: 1.2027 1.2354 1.2348 1.2412 2.1148 2.1534 2.1100 3.1213 3.8869 3.7065 3.9062 4.1168 3.9013 3.9040 4.2233 4.3576 3.8418 3.6429 4.0172 3.9657 4.0116 3.8893 3.9446 4.0313 3.8190 4.0368 3.9461 3.9339 3.9503 3.9581 1.0450 1.0278 1.0032 1.0085 1.0083 1.0052 1.0038 1.0040 1.0206 1.0212 1.0155 1.0190 0.9990 1.0107 1.0127 1.0025 0.9988 0.9993 0.9999
dispcorr: -0.029230144 hartree
energy: -11427.142816207592
dipole: -172.02804 171.73205 -0.29599 53.24465 -53.71860 -0.47394 -51.11307 50.13991 -0.97316
magnitude: 1.12218 au
magnitude: 2.85235 debye
