program: Orca
programVersion: 5.0.2
elementType: Br Br Br Br O O O N C C C C C C C C C C C C C C C C C C C C C C H H H H H H H H H H H H H H H H H H H
charge: 0
multiplicity: 1
keywords: wb97x-d3
keywords: def2-TZVPP
keywords: def2/J RIJCOSX
keywords: DEFGRID2
keywords: scfconv7
keywords: smallprint printgap noloewdin
keywords: NOSOSCF
formula: C22H19Br4NO3
InChI: InChI=1/C22H19Br4NO3/c1-21(2)17(19(23)22(24,25)26)18(21)20(28)30-16(12-27)13-7-6-10-15(11-13)29-14-8-4-3-5-9-14/h3-11,16-19H,1-2H3
49 atoms
Br 3.342307 -0.01752 -1.40742
Br 0.734672 1.621689 0.191392
Br 0.686002 -0.660966 2.34742
Br 3.319041 0.965037 1.866533
O  -1.706518 -2.119919 -0.555749
O  -1.377397 -4.063599 0.511008
O  -3.456562 2.625065 -0.363134
N  -3.83899 -3.153266 -2.910596
C  1.232627 -2.805196 -1.517455
C  1.067376 -1.539012 -0.736479
C  0.513254 -2.822486 -0.181864
C  2.206632 -0.850739 -0.045308
C  2.558962 -3.527723 -1.555284
C  0.460268 -2.928186 -2.808751
C  -0.933154 -3.091306 -0.027102
C  1.773154 0.203821 0.985934
C  -3.106925 -2.308859 -0.543244
C  -3.823346 -1.018147 -0.215557
C  -3.513017 -2.786004 -1.871912
C  -3.231709 0.214216 -0.45528
C  -5.111661 -1.099796 0.292319
C  -3.955396 1.3730 -0.198064
C  -5.817104 0.063697 0.553986
C  -5.248637 1.29942 0.305632
C  -2.437599 2.898269 -1.227557
C  -2.367451 2.357643 -2.505225
C  -1.486512 3.81466 -0.79815
C  -1.320907 2.721679 -3.339469
C  -0.454873 4.181807 -1.64997
C  -0.360188 3.628757 -2.918647
H  0.340831 -0.855782 -1.161224
H  1.078973 -3.301356 0.609601
H  2.845287 -1.567454 0.477413
H  3.195248 -3.12754 -2.344752
H  3.112235 -3.462352 -0.618486
H  2.397889 -4.587099 -1.759291
H  1.068058 -2.556168 -3.634641
H  0.217264 -3.970788 -3.018521
H  -0.469088 -2.362338 -2.810857
H  -3.382392 -3.0774 0.185438
H  -2.217492 0.272164 -0.825168
H  -5.566062 -2.064508 0.480469
H  -6.820724 0.007734 0.952882
H  -5.793257 2.212385 0.50598
H  -3.120058 1.661735 -2.852958
H  -1.566525 4.240352 0.19369
H  -1.264496 2.293283 -4.33133
H  0.283142 4.897327 -1.312384
H  0.453095 3.905822 -3.574957
nucrepener: 5994.77934408 hartree
xcener: -389.818702209695 hartree
chargesum: 0.0000000
charge: -0.062661 -0.013626 -0.011715 0.003787 -0.270477 -0.335877 -0.289402 -0.000180 0.076178 -0.059859 -0.169813 -0.178779 -0.254707 -0.243057 0.350464 0.065603 0.266500 0.075884 -0.262567 -0.197185 -0.195667 0.316559 -0.076726 -0.221094 0.308143 -0.201338 -0.279435 -0.111200 -0.111396 -0.114262 0.109323 0.106528 0.149856 0.100098 0.074780 0.106464 0.095804 0.104885 0.080395 0.132812 0.087135 0.115724 0.128746 0.128372 0.143395 0.137562 0.131346 0.136694 0.127987
qa: -0.0627 -0.0136 -0.0117 0.0038 -0.2705 -0.3359 -0.2894 -0.0002 0.0762 -0.0599 -0.1698 -0.1788 -0.2547 -0.2431 0.3505 0.0656 0.2665 0.0759 -0.2626 -0.1972 -0.1957 0.3166 -0.0767 -0.2211 0.3081 -0.2013 -0.2794 -0.1112 -0.1114 -0.1143 0.1093 0.1065 0.1499 0.1001 0.0748 0.1065 0.0958 0.1049 0.0804 0.1328 0.0871 0.1157 0.1287 0.1284 0.1434 0.1376 0.1313 0.1367 0.1280
va: 1.2022 1.2512 1.2329 1.2417 2.0988 2.1718 2.1344 3.1130 3.8920 3.6671 3.9073 4.1054 3.9123 3.9136 4.2568 4.3358 3.7925 3.7709 3.9873 3.9842 4.0352 3.7626 3.9532 4.0372 3.7001 3.9408 3.9330 3.9357 3.8615 3.9310 1.0255 1.0250 1.0019 1.0075 1.0084 1.0043 1.0054 1.0021 1.0186 1.0377 1.0289 1.0103 0.9992 1.0137 0.9994 1.0160 0.9992 0.9984 0.9994
dispcorr: -0.034306673 hartree
energy: -11427.146125018835
dipole: -87.35980 87.84650 0.48671 -28.07163 28.64367 0.57204 -53.43573 53.70670 0.27097
magnitude: 0.79846 au
magnitude: 2.02951 debye
