program: Orca
programVersion: 5.0.2
elementType: O O O O N C C C C C C C C C C C C C C C C C C C H H H H H H H H H H H H H H H H H H H H H H H H H
charge: 0
multiplicity: 1
keywords: wb97x-d3
keywords: def2-TZVPP
keywords: def2/J RIJCOSX
keywords: DEFGRID2
keywords: scfconv7
keywords: smallprint printgap noloewdin
keywords: NOSOSCF
formula: C19H25NO4
InChI: InChI=1/C19H25NO4/c1-11(2)9-14-15(19(14,3)4)18(23)24-10-20-16(21)12-7-5-6-8-13(12)17(20)22/h9,14-15H,5-8,10H2,1-4H3
49 atoms
O  1.087018 -1.657753 -0.972839
O  1.895599 -1.541013 1.117609
O  -1.806711 -1.688102 -2.742826
O  -1.090531 -0.859892 1.668364
N  -1.207849 -1.604544 -0.515968
C  4.214476 0.157192 -0.078313
C  3.091736 1.11514 0.106477
C  2.855119 -0.213101 -0.634771
C  5.239539 0.494683 -1.136271
C  4.814953 -0.565286 1.102397
C  2.479234 1.392994 1.426858
C  1.94236 -1.192205 -0.036387
C  1.249624 1.892461 1.579817
C  -0.037307 -2.423462 -0.571999
C  0.698929 2.222037 2.931579
C  0.350716 2.169462 0.407679
C  -2.949624 -0.241976 -1.17386
C  -2.734871 0.001751 0.119574
C  -4.002681 0.395171 -2.000646
C  -3.525443 0.937282 0.954467
C  -4.58983 1.592277 -1.250408
C  -4.825329 1.286764 0.228356
C  -1.959644 -1.245693 -1.63164
C  -1.595373 -0.829905 0.573526
H  3.074694 1.956115 -0.582366
H  2.751977 -0.120941 -1.709209
H  4.796275 1.028224 -1.977856
H  6.025648 1.126748 -0.719548
H  5.711135 -0.409796 -1.524845
H  5.23572 -1.523219 0.792418
H  5.63182 0.032648 1.51075
H  4.116748 -0.756832 1.911605
H  3.084563 1.212911 2.309783
H  0.11314 -2.908151 0.389746
H  -0.179607 -3.190852 -1.327833
H  1.418463 2.030908 3.727627
H  0.404185 3.273251 2.986573
H  -0.202098 1.639165 3.139364
H  0.35636 1.35655 -0.320497
H  -0.680371 2.329563 0.723992
H  0.663314 3.070814 -0.12636
H  -3.593754 0.702342 -2.965913
H  -4.778929 -0.343592 -2.22354
H  -3.728653 0.495676 1.932508
H  -2.932208 1.83749 1.145941
H  -3.907492 2.441931 -1.33934
H  -5.525913 1.891432 -1.723053
H  -5.52203 0.448826 0.318206
H  -5.297343 2.140866 0.714872
elementType: O N C H
totalener: -1094.86618727 hartree
nucrepener: 2199.98438920 hartree
electener: -3294.85057647 hartree
oneelecener: -5862.76308474 hartree
twoeener: 2567.91250827 hartree
cpcmener: -0.04383915 hartree
kineticenergy: 1090.03665740 hartree
xcener: -105.974287641159 hartree
chargesum: 0.0000000
charge: -0.291574 -0.472905 -0.434491 -0.431873 -0.076357 0.133621 -0.019034 -0.105056 -0.263832 -0.297002 -0.274278 0.402979 -0.024252 0.071677 -0.206187 -0.292730 -0.053435 -0.066879 -0.069829 -0.072155 -0.135364 -0.135813 0.338036 0.291692 0.115628 0.094420 0.088254 0.095363 0.096438 0.102619 0.100691 0.090651 0.127563 0.133576 0.132598 0.088649 0.102082 0.083473 0.090335 0.100216 0.124354 0.093940 0.102055 0.096852 0.104320 0.078273 0.081223 0.080343 0.081126
qa: -0.2916 -0.4729 -0.4345 -0.4319 -0.0764 0.1336 -0.0190 -0.1051 -0.2638 -0.2970 -0.2743 0.4030 -0.0243 0.0717 -0.2062 -0.2927 -0.0534 -0.0669 -0.0698 -0.0722 -0.1354 -0.1358 0.3380 0.2917 0.1156 0.0944 0.0883 0.0954 0.0964 0.1026 0.1007 0.0907 0.1276 0.1336 0.1326 0.0886 0.1021 0.0835 0.0903 0.1002 0.1244 0.0939 0.1021 0.0969 0.1043 0.0783 0.0812 0.0803 0.0811
va: 2.0977 2.0151 2.0750 2.0617 3.1034 3.7708 3.7997 3.8410 3.8964 3.8910 3.8065 4.0865 3.6905 3.9081 3.9044 3.9580 3.6813 3.6372 3.9218 3.9079 3.9148 3.9198 4.1880 4.1624 1.0031 1.0333 1.0043 1.0022 1.0022 1.0000 0.9984 1.0169 0.9997 1.0172 1.0074 1.0087 0.9945 1.0039 0.9985 1.0064 0.9994 1.0154 1.0037 1.0166 1.0060 1.0074 1.0091 1.0067 1.0095
dispcorr: -0.027523053 hartree
energy: -1094.893710322927
dipole: 6.58490 -7.88168 -1.29678 19.23234 -17.57088 1.66146 5.15854 -6.05196 -0.89342
magnitude: 2.28917 au
magnitude: 5.81860 debye
