program: Gaussian 09
title: 000067151
version: EM64L-G09RevD.01
frameworkgroup: C1[X(C8H18N2O2)]
method: RPBEPBE
basis: SDD
operation: Freq
keyword: #p
keyword: freq=noraman
keyword: PBEPBE/SDD
title: #p freq=noraman PBEPBE/SDD
converged: YES YES NO NO
title: Mulliken charges:
elementType: O O N N C C C C C C C C H H H H H H H H H H H H H H H H H H
charge: -0.437866 -0.439244 -0.086925 -0.082735 -0.365915 -0.374111 -0.369521 -0.373574 -0.333124 -0.341625 -0.335106 -0.326165 0.192716 0.200772 0.204338 0.190684 0.188562 0.200128 0.208654 0.187410 0.203611 0.190154 0.167639 0.224909 0.203119 0.216985 0.234199 0.188562 0.332326 0.331146
chargesum: 0.00000
title: Mulliken charges with hydrogens summed into heavy atoms:
elementType: O O N N C C C C C C C C
charge: -0.105540 -0.108098 -0.086925 -0.082735 0.027573 0.020911 0.019168 0.022490 0.060640 0.050922 0.084998 0.096596
polarizability: 1.37259826e+02 -1.73341429e+00 9.89519110e+01 3.48571136e+00 -8.37057210e-01 8.72461963e+01
1716.lowfreq: -13.7205 -0.0008 -0.0008 -0.0004 7.1945 13.9415 38.5589 47.4467 62.0673
frequency: 38.0498 47.0314 61.9554 66.4282 108.7805 114.5832 208.3221 237.0886 249.8680 256.7123 304.8175 308.3968 332.7419 343.9937 359.9385 404.0940 408.8778 486.5506 523.4894 626.4568 763.7568 789.0014 800.1792 810.2128 847.6371 924.9667 958.0388 966.6922 1004.2057 1016.7202 1041.0576 1043.7213 1053.4212 1063.4232 1072.6699 1096.7456 1120.8516 1132.2602 1141.7977 1147.9890 1182.0162 1196.1427 1230.6466 1261.7630 1270.1871 1285.8008 1290.8154 1300.0716 1305.6362 1308.2781 1334.8254 1340.2270 1349.3754 1363.8046 1372.1865 1380.8467 1392.2124 1399.4232 1451.1753 1451.8547 1459.6910 1462.7594 1469.4860 1471.4818 1480.1488 1482.6939 2819.9650 2854.7511 2863.1917 2870.5770 2875.6083 2887.0936 2968.9920 2982.7296 3000.1805 3028.8652 3033.2969 3039.2727 3041.1917 3047.4933 3089.0220 3102.9109 3556.1226 3561.1015
redmass: 4.5264 1.9188 3.1231 2.8566 3.8370 3.0718 3.2146 2.7468 2.4077 2.3327 1.2341 1.2813 2.4507 2.0079 4.0854 3.8011 2.0624 2.7669 5.3158 1.9669 4.1637 2.0048 1.2006 1.3641 1.5208 2.3759 4.0885 3.6911 2.4867 3.0361 1.7486 2.0074 1.9954 2.3352 1.8907 2.0087 1.6133 2.3957 2.5584 2.8159 1.4296 1.0892 1.9656 1.3130 1.2713 1.2637 1.2156 1.2772 1.3618 1.2840 1.2803 1.2907 1.2906 1.3175 1.4131 1.2950 1.3618 1.4223 1.0807 1.0791 1.0837 1.0826 1.0928 1.0980 1.0867 1.0879 1.0708 1.0708 1.0697 1.0699 1.0686 1.0674 1.0690 1.0681 1.0889 1.0910 1.0879 1.0864 1.0901 1.0878 1.0982 1.0964 1.0661 1.0662
irintensity: 0.4702 6.9717 1.9006 5.1138 1.7933 3.1720 0.7515 1.9211 3.8226 14.8155 128.8657 96.4756 42.4046 42.8317 37.2116 6.2039 1.0824 0.3160 1.0929 2.2780 0.5254 18.3292 9.0118 1.0982 0.0937 6.5164 189.4203 33.5221 68.7915 1.8473 8.1329 1.0846 3.9179 7.6991 25.0409 8.9892 33.8192 21.5059 1.4827 70.6546 15.7404 0.2331 0.3674 18.0388 2.5835 10.1462 11.3435 9.8454 19.3892 3.4107 26.3858 9.2764 36.7267 4.5357 1.6786 2.7892 0.7889 0.1710 1.1310 0.4447 9.2503 6.9537 12.1278 0.8517 7.9122 7.0805 97.1956 84.1283 21.6328 2.6592 111.8061 235.8836 54.9494 61.0362 28.1416 36.7412 31.8209 59.5764 41.1167 31.1614 40.2394 27.8141 7.7310 6.6964
temp: 298.150 k
press: 1.00000 atm
elementType: 8 8 7 7 6 6 6 6 6 6 6 6 1 1 1 1 1 1 1 1 1 1 1 1 1 1 1 1 1 1
symmnumber: 1
zpe: 689045.7 jmol-1
zpe.correction: 0.262444 hartree
zpe.thermalcorrener: 0.276249 hartree
zpe.thermalcorrenthalpy: 0.277194 hartree
zpe.thermalcorrgfe: 0.220993 hartree
zpe.sumelectzpe: -574.533686 hartree
zpe.sumelectthermal: -574.519881 hartree
zpe.sumelectthermalent: -574.518936 hartree
zpe.sumelectthermalfe: -574.575137 hartree
dipole: -0.6372 1.2011 1.6678
dipole: 2.1517
quadrupole: -96.0494 -70.4581 -75.0394
quadrupole: -12.5965 6.1988 -1.7409
quadrupole: -15.5338 10.0576 5.4762 -12.5965 6.1988 -1.7409
hfenergy: -574.7961299 hartree
pointgroup: C01 [X(C8H18N2O2)]
dipole: 0.2473044 0.4809528 -0.6513013 debye
polarizability: 137.2973881|1.6818569|98.927155|3.2370942|0.9788824|87.2333899 unknown
InChI: InChI=1S/C8H18N2O2/c11-7-5-9-1-2-10(4-3-9)6-8-12/h11-12H,1-8H2
charge 0 multiplicity 1
30 atoms
O  5.143251 -0.645942 -0.003147
O  -5.159598 -0.524367 0.033622
N  1.455029 0.295074 -0.112183
N  -1.445208 0.296638 0.074078
C  0.706775 -0.92358 0.286886
C  0.707663 1.50805 0.304951
C  -0.699136 -0.918691 -0.336178
C  -0.696029 1.514451 -0.323283
C  2.859772 0.290444 0.360374
C  -2.851016 0.305272 -0.387818
C  3.762113 -0.609331 -0.510801
C  -3.76027 -0.582822 0.487155
H  0.608707 -0.991199 1.39991
H  1.252308 -1.818313 -0.062592
H  1.263388 2.402133 -0.034711
H  0.600566 1.564871 1.417603
H  -0.598626 -0.974774 -1.450396
H  -1.246134 -1.81635 0.003876
H  -1.25121 2.402863 0.030706
H  -0.588595 1.589007 -1.435126
H  2.955015 -0.030768 1.42712
H  3.240963 1.330374 0.302532
H  -2.942925 -0.013319 -1.461444
H  -3.237354 1.33943 -0.328916
H  3.718017 -0.265956 -1.564629
H  3.436249 -1.661486 -0.472637
H  -3.776949 -0.199658 1.518727
H  -3.398095 -1.632152 0.508508
H  5.536776 0.260357 -0.073488
H  -5.211547 -0.872955 -0.892501
