program: Orca
programVersion: 5.0.2
elementType: O O O O N C C C C C C C C C C C C C C C C C C C H H H H H H H H H H H H H H H H H H H H H H H H H
charge: 0
multiplicity: 1
keywords: wb97x-d3
keywords: def2-TZVPP
keywords: def2/J RIJCOSX
keywords: DEFGRID2
keywords: scfconv7
keywords: smallprint printgap noloewdin
keywords: NOSOSCF
formula: C19H25NO4
InChI: InChI=1/C19H25NO4/c1-11(2)9-14-15(19(14,3)4)18(23)24-10-20-16(21)12-7-5-6-8-13(12)17(20)22/h9,14-15H,5-8,10H2,1-4H3
49 atoms
O  1.166948 -1.154309 -0.500373
O  2.705195 -2.159799 -1.757127
O  -1.436526 -0.039665 -2.454489
O  -1.163484 -2.146086 1.553211
N  -1.09667 -1.414739 -0.632482
C  3.602663 -0.234846 1.165122
C  3.056391 0.906503 0.380949
C  3.392068 -0.403761 -0.334154
C  5.051099 -0.164542 1.587681
C  2.743751 -0.9750 2.160913
C  1.678321 1.427432 0.549733
C  2.410736 -1.321886 -0.930358
C  1.078085 2.222489 -0.339148
C  0.141501 -1.996393 -1.020498
C  -0.298007 2.766418 -0.110578
C  1.732171 2.589355 -1.641073
C  -2.796699 0.133474 -0.460531
C  -2.702809 -0.469253 0.726177
C  -3.794298 1.170224 -0.816924
C  -3.554733 -0.170838 1.90241
C  -4.883422 1.222345 0.255352
C  -4.300195 1.143559 1.665035
C  -1.729991 -0.396058 -1.341091
C  -1.591566 -1.447404 0.668763
H  3.785926 1.673593 0.131319
H  4.30708 -0.391037 -0.914816
H  5.475366 -1.164422 1.695818
H  5.659175 0.380681 0.865133
H  5.144309 0.341289 2.550548
H  1.68364 -0.989277 1.921613
H  3.076348 -2.010117 2.255372
H  2.846833 -0.509655 3.14289
H  1.147098 1.164186 1.459324
H  0.225943 -3.001119 -0.608309
H  0.184479 -2.052922 -2.106839
H  -0.28003 3.857388 -0.038684
H  -0.955501 2.529491 -0.950547
H  -0.752863 2.376119 0.800308
H  1.733065 1.740355 -2.330227
H  1.209427 3.406224 -2.137959
H  2.772676 2.892383 -1.514344
H  -3.289443 2.137613 -0.906638
H  -4.222885 0.96156 -1.799914
H  -4.257926 -0.994133 2.061735
H  -2.943757 -0.11571 2.806144
H  -5.462338 2.139276 0.140264
H  -5.578128 0.391572 0.104523
H  -5.093868 1.251144 2.40498
H  -3.610778 1.978981 1.817905
elementType: O N C H
totalener: -1094.86409934 hartree
nucrepener: 2223.56480834 hartree
electener: -3318.42890768 hartree
oneelecener: -5908.93848521 hartree
twoeener: 2590.50957753 hartree
cpcmener: -0.03838242 hartree
kineticenergy: 1090.05193259 hartree
xcener: -105.976458763336 hartree
chargesum: 0.0000000
charge: -0.251724 -0.502925 -0.431909 -0.433192 -0.096024 0.122205 -0.036195 -0.132103 -0.268356 -0.273095 -0.231940 0.432338 -0.040845 0.068853 -0.230985 -0.273882 -0.079766 -0.034508 -0.068281 -0.071768 -0.130181 -0.139558 0.302217 0.316552 0.119630 0.094095 0.096924 0.087727 0.094117 0.071743 0.104680 0.101747 0.128704 0.144553 0.126491 0.115377 0.086299 0.086406 0.098619 0.100477 0.101111 0.108003 0.099723 0.102859 0.093380 0.080902 0.079534 0.083069 0.078906
qa: -0.2517 -0.5029 -0.4319 -0.4332 -0.0960 0.1222 -0.0362 -0.1321 -0.2684 -0.2731 -0.2319 0.4323 -0.0408 0.0689 -0.2310 -0.2739 -0.0798 -0.0345 -0.0683 -0.0718 -0.1302 -0.1396 0.3022 0.3166 0.1196 0.0941 0.0969 0.0877 0.0941 0.0717 0.1047 0.1017 0.1287 0.1446 0.1265 0.1154 0.0863 0.0864 0.0986 0.1005 0.1011 0.1080 0.0997 0.1029 0.0934 0.0809 0.0795 0.0831 0.0789
va: 2.1054 1.9943 2.0632 2.0687 3.1454 3.7822 3.7863 3.8807 3.9052 3.9077 3.7622 4.0848 3.7048 3.9065 3.9213 3.9505 3.6622 3.6614 3.9053 3.9151 3.9114 3.9122 4.1537 4.1679 1.0015 1.0292 1.0016 1.0056 1.0019 1.0125 1.0007 1.0000 0.9973 0.9969 1.0119 0.9955 0.9996 1.0070 0.9985 1.0035 1.0002 1.0056 1.0166 1.0035 1.0160 1.0100 1.0069 1.0098 1.0091
dispcorr: -0.028549270 hartree
energy: -1094.892648610845
dipole: 2.74047 -4.48218 -1.74171 18.03973 -16.23718 1.80256 10.10040 -8.71640 1.38400
magnitude: 2.86325 au
magnitude: 7.27781 debye
