program: Orca
programVersion: 5.0.2
elementType: O O O O N C C C C C C C C C C C C C C C C C C C H H H H H H H H H H H H H H H H H H H H H H H H H
charge: 0
multiplicity: 1
keywords: wb97x-d3
keywords: def2-TZVPP
keywords: def2/J RIJCOSX
keywords: DEFGRID2
keywords: scfconv7
keywords: smallprint printgap noloewdin
keywords: NOSOSCF
formula: C19H25NO4
InChI: InChI=1/C19H25NO4/c1-11(2)9-14-15(19(14,3)4)18(23)24-10-20-16(21)12-7-5-6-8-13(12)17(20)22/h9,14-15H,5-8,10H2,1-4H3
49 atoms
O  1.174235 -1.124579 -0.5027
O  2.701943 -2.125378 -1.773969
O  -1.423621 0.055222 -2.416455
O  -1.199566 -2.21612 1.505824
N  -1.090856 -1.374806 -0.637555
C  3.58026 -0.206527 1.185065
C  3.116059 0.933235 0.346649
C  3.412631 -0.410804 -0.315337
C  5.013773 -0.189844 1.660598
C  2.648805 -0.866478 2.172325
C  1.762331 1.531024 0.482224
C  2.417041 -1.300154 -0.93088
C  1.116118 2.193502 -0.479726
C  0.144508 -1.950446 -1.041354
C  -0.202942 2.856384 -0.223225
C  1.634992 2.322309 -1.877914
C  -2.776029 0.182894 -0.412598
C  -2.712857 -0.487018 0.739963
C  -3.737129 1.271053 -0.714858
C  -3.603923 -0.266754 1.904756
C  -4.381367 1.752177 0.585742
C  -4.801155 0.584114 1.476923
C  -1.716147 -0.32967 -1.312031
C  -1.606328 -1.468409 0.652215
H  3.890018 1.657165 0.103052
H  4.346676 -0.450313 -0.863525
H  5.677218 0.284298 0.936604
H  5.097617 0.361122 2.599336
H  5.380178 -1.202856 1.836757
H  1.596582 -0.811679 1.906105
H  2.906931 -1.919605 2.296718
H  2.759573 -0.3880 3.14726
H  1.29646 1.462558 1.461326
H  0.225828 -2.964767 -0.652657
H  0.18602 -1.981773 -2.128724
H  -0.114868 3.942188 -0.317665
H  -0.950192 2.549555 -0.958183
H  -0.590583 2.636789 0.771733
H  1.66871 3.369497 -2.188387
H  2.630201 1.901132 -2.009224
H  0.963873 1.816747 -2.577757
H  -3.232769 2.092449 -1.228714
H  -4.496611 0.899181 -1.409755
H  -3.930837 -1.222235 2.320857
H  -3.038271 0.231101 2.698665
H  -3.66971 2.383813 1.12554
H  -5.244738 2.377303 0.355667
H  -5.513191 -0.044607 0.935156
H  -5.320286 0.95382 2.361734
elementType: O N C H
totalener: -1094.86522182 hartree
nucrepener: 2224.90449196 hartree
electener: -3319.76971378 hartree
oneelecener: -5911.64648313 hartree
twoeener: 2591.87676935 hartree
cpcmener: -0.03779392 hartree
kineticenergy: 1090.05005608 hartree
xcener: -105.976485074840 hartree
chargesum: -0.0000000
charge: -0.254124 -0.502842 -0.431978 -0.433315 -0.090890 0.142004 -0.017299 -0.155633 -0.270553 -0.284357 -0.255731 0.445842 -0.028152 0.069831 -0.232077 -0.262804 -0.050849 -0.041729 -0.088855 -0.072245 -0.129086 -0.134231 0.282411 0.319688 0.115052 0.095935 0.088232 0.094412 0.096351 0.075906 0.105721 0.100900 0.126163 0.143816 0.127427 0.114170 0.072606 0.092505 0.105899 0.093938 0.094667 0.105448 0.109896 0.095141 0.102532 0.078232 0.081659 0.078935 0.081434
qa: -0.2541 -0.5028 -0.4320 -0.4333 -0.0909 0.1420 -0.0173 -0.1556 -0.2706 -0.2844 -0.2557 0.4458 -0.0282 0.0698 -0.2321 -0.2628 -0.0508 -0.0417 -0.0889 -0.0722 -0.1291 -0.1342 0.2824 0.3197 0.1151 0.0959 0.0882 0.0944 0.0964 0.0759 0.1057 0.1009 0.1262 0.1438 0.1274 0.1142 0.0726 0.0925 0.1059 0.0939 0.0947 0.1054 0.1099 0.0951 0.1025 0.0782 0.0817 0.0789 0.0814
va: 2.1055 1.9953 2.0625 2.0693 3.1375 3.7255 3.7922 3.8898 3.9074 3.9142 3.8230 4.0695 3.6920 3.9037 3.9239 3.9443 3.6397 3.6895 3.9105 3.9151 3.9062 3.9143 4.1621 4.1686 1.0050 1.0281 1.0053 1.0016 1.0015 1.0088 1.0006 0.9999 0.9974 0.9979 1.0114 0.9976 1.0035 1.0058 0.9997 1.0049 1.0044 1.0047 1.0051 1.0136 1.0059 1.0092 1.0103 1.0066 1.0097
dispcorr: -0.028641024 hartree
energy: -1094.893862848552
dipole: 2.45079 -4.18914 -1.73835 17.72121 -15.91401 1.80720 9.99765 -8.56029 1.43736
magnitude: 2.89030 au
magnitude: 7.34656 debye
