program: Gaussian 09
title: 000067159
version: EM64L-G09RevD.01
frameworkgroup: C1[X(C9H24N2O)]
method: RPBEPBE
basis: SDD
operation: Freq
keyword: #p
keyword: freq=noraman
keyword: PBEPBE/SDD
title: #p freq=noraman PBEPBE/SDD
converged: YES YES NO NO
title: Mulliken charges:
elementType: O N N C C C C C C C C C H H H H H H H H H H H H H H H H H H H H H H H H
charge: -0.416087 -0.110740 -0.110960 -0.099626 -0.373425 -0.373905 -0.539309 -0.560969 -0.577880 -0.561193 -0.539080 -0.577458 0.278975 0.278153 0.283117 0.278061 0.283088 0.277184 0.285969 0.274156 0.299819 0.283973 0.265895 0.270046 0.291024 0.287118 0.300390 0.265818 0.283875 0.277061 0.274222 0.285987 0.270194 0.286238 0.291225 0.369043
chargesum: 2.00000
title: Mulliken charges with hydrogens summed into heavy atoms:
elementType: O N N C C C C C C C C C
charge: -0.047043 -0.110740 -0.110960 0.179349 0.187845 0.187243 0.298001 0.288719 0.270308 0.288890 0.298190 0.270200
polarizability: 1.27352014e+02 3.68521322e-04 1.00345822e+02 9.23612360e-03 -1.02692020e+00 9.81835591e+01
1716.lowfreq: -0.0004 -0.0002 0.0002 2.2308 11.7013 13.9286 26.2828 58.2806 82.5979
frequency: 26.0843 58.2768 82.5712 107.6793 148.7915 218.4195 222.4227 224.2219 231.8587 264.9581 287.0766 294.2251 303.4763 306.0228 311.4635 349.1190 350.4855 399.5178 409.6752 426.6667 429.7416 445.5100 465.4878 477.3356 508.5398 595.2260 698.1574 744.9265 827.5999 849.2973 871.6099 896.6006 904.0665 924.5792 938.3984 944.4723 1000.3344 1045.8988 1047.4986 1049.2166 1059.6084 1095.0166 1097.9867 1107.8818 1124.3635 1170.6906 1182.9134 1215.1931 1223.6040 1245.8561 1247.1417 1255.8733 1298.6076 1324.8548 1350.0502 1382.6646 1384.4204 1388.9970 1420.5313 1420.7360 1424.8830 1425.7590 1438.4151 1447.8297 1453.1030 1454.1175 1460.9315 1462.6450 1465.1368 1470.7943 1471.5779 1471.9122 1484.4687 1485.5632 1492.6058 1494.0956 1505.5897 1506.7815 3008.8895 3013.9436 3024.3475 3024.4247 3025.2934 3025.4153 3029.3113 3029.4408 3072.2933 3079.2241 3094.8282 3139.1259 3139.3051 3142.8690 3142.9899 3146.1042 3146.1817 3150.2427 3150.4275 3150.7560 3150.8586 3164.1347 3164.3211 3527.0893
redmass: 2.7219 4.4813 2.6783 3.3880 1.9591 2.0265 1.2426 1.2849 2.8169 2.0140 1.1187 1.0888 1.3189 1.0692 2.9106 2.0816 2.2874 2.5430 2.5176 2.1657 2.2730 2.2014 1.0952 2.1121 2.4802 3.2191 4.4451 4.0096 3.7082 2.7211 2.6471 3.2776 3.1638 2.5652 2.1208 2.9821 1.5089 1.5249 1.1972 1.6928 2.5293 1.2163 1.3019 1.3753 1.6848 1.2786 1.3362 1.7132 1.8524 1.8713 1.9103 1.9003 1.4862 1.1685 1.2773 1.2857 1.1590 1.1934 1.1420 1.1403 1.1544 1.1542 1.0882 1.0851 1.0525 1.0512 1.1118 1.1003 1.0705 1.0460 1.0608 1.0658 1.0498 1.0524 1.0509 1.0520 1.0517 1.0514 1.0588 1.0595 1.0321 1.0321 1.0322 1.0322 1.0334 1.0337 1.0923 1.1070 1.0986 1.1055 1.1054 1.1058 1.1058 1.1062 1.1061 1.1067 1.1066 1.1057 1.1057 1.1063 1.1062 1.0667
irintensity: 0.4441 3.9914 0.7377 1.6030 0.3349 0.0121 0.5156 0.0432 13.9462 0.5870 0.0163 0.9176 17.4106 0.1414 0.7509 0.8734 18.2516 4.8149 0.3153 0.0574 0.1486 12.5265 181.9598 3.0919 0.0052 21.0224 3.2990 0.4442 2.0294 31.1539 32.2697 14.8647 68.2004 10.4136 0.2793 23.8117 32.9455 0.0191 0.1432 0.2060 24.5554 13.2954 0.6829 0.0935 5.1596 7.0301 0.0155 0.9562 0.8029 5.1065 1.3221 5.3921 0.8139 13.6532 5.1378 0.0970 11.3531 1.8644 35.0445 6.7359 30.6189 3.3774 0.1489 4.6564 2.6332 0.1713 10.8228 12.1177 7.5609 12.5394 6.8324 7.3555 30.1938 72.5068 2.8493 87.1604 101.5586 56.9897 0.8899 2.8440 2.2485 1.5831 2.3037 2.0933 0.5397 1.5950 0.7096 0.1956 8.1627 0.0913 2.2446 1.5934 0.3251 0.1994 2.9942 0.4604 3.2200 2.3809 0.7371 1.6960 0.7339 24.6426
temp: 298.150 k
press: 1.00000 atm
elementType: 8 7 7 6 6 6 6 6 6 6 6 6 1 1 1 1 1 1 1 1 1 1 1 1 1 1 1 1 1 1 1 1 1 1 1 1
symmnumber: 1
zpe: 878313.4 jmol-1
zpe.correction: 0.334532 hartree
zpe.thermalcorrener: 0.350089 hartree
zpe.thermalcorrenthalpy: 0.351034 hartree
zpe.thermalcorrgfe: 0.293048 hartree
zpe.sumelectzpe: -540.421767 hartree
zpe.sumelectthermal: -540.406210 hartree
zpe.sumelectthermalent: -540.405266 hartree
zpe.sumelectthermalfe: -540.463252 hartree
dipole: -0.0143 -2.1972 -1.3462
dipole: 2.5768
quadrupole: 14.6540 -60.4295 -58.5597
quadrupole: -0.0101 0.0017 -3.3725
quadrupole: 49.4324 -25.6511 -23.7813 -0.0101 0.0017 -3.3725
hfenergy: -540.7562994 hartree
pointgroup: C01 [X(C9H24N2O1)]
dipole: -0.0039625 0.6750769 0.7563356 debye
polarizability: 127.3519132|-0.0212618|100.7330797|-0.0507081|-0.2593661|97.7964014 unknown
InChI: InChI=1S/C9H24N2O/c1-10(2,3)7-9(12)8-11(4,5)6/h9,12H,7-8H2,1-6H3
charge 2 multiplicity 1
36 atoms
O  -0.000518 -1.506175 -0.52045
N  2.623467 0.111411 -0.004288
N  -2.627004 0.1155 0.002942
C  -0.001953 -0.102754 -0.109272
C  1.259378 0.299077 0.706604
C  -1.260869 0.295034 0.711833
C  3.6738 0.867188 0.830059
C  3.035576 -1.368777 -0.072653
C  2.611015 0.690139 -1.422132
C  -3.037424 -1.364025 -0.085735
C  -3.675537 0.857859 0.851571
C  -2.620108 0.71534 -1.40611
H  -0.004149 0.448399 -1.063363
H  1.200862 1.372091 0.964003
H  1.323592 -0.276656 1.64846
H  -1.200403 1.36576 0.97818
H  -1.323865 -0.288355 1.649112
H  3.644106 0.501953 1.868237
H  4.668954 0.676111 0.4015
H  3.457676 1.946185 0.799307
H  2.301619 -1.91751 -0.677726
H  4.031062 -1.427759 -0.538498
H  3.087427 -1.774179 0.95002
H  2.244004 1.72812 -1.393346
H  3.641522 0.681165 -1.808553
H  1.980775 0.064505 -2.070723
H  -2.304009 -1.903535 -0.699777
H  -3.086545 -1.783937 0.931242
H  -4.033797 -1.417422 -0.550342
H  -3.641399 0.478474 1.884518
H  -3.461437 1.937573 0.834802
H  -4.671932 0.670891 0.424078
H  -2.251716 1.752357 -1.363367
H  -1.993629 0.099011 -2.067134
H  -3.652296 0.71322 -1.788131
H  -0.003145 -2.116579 0.263631
