program: Orca
programVersion: 5.0.2
elementType: O O O O N C C C C C C C C C C C C C C C C C C C H H H H H H H H H H H H H H H H H H H H H H H H H
charge: 0
multiplicity: 1
keywords: wb97x-d3
keywords: def2-TZVPP
keywords: def2/J RIJCOSX
keywords: DEFGRID2
keywords: scfconv7
keywords: smallprint printgap noloewdin
keywords: NOSOSCF
formula: C19H25NO4
InChI: InChI=1/C19H25NO4/c1-11(2)9-14-15(19(14,3)4)18(23)24-10-20-16(21)12-7-5-6-8-13(12)17(20)22/h9,14-15H,5-8,10H2,1-4H3
49 atoms
O  1.168426 -0.995345 -0.519007
O  2.669728 -2.135267 -1.697973
O  -1.530215 0.373844 -2.289487
O  -1.212242 -2.299733 1.368401
N  -1.104381 -1.190443 -0.649141
C  3.495312 -0.194267 1.309082
C  3.283238 0.917319 0.340479
C  3.454271 -0.508612 -0.179563
C  4.862793 -0.323983 1.938428
C  2.385975 -0.621217 2.238554
C  2.015855 1.690104 0.280759
C  2.41449 -1.289546 -0.869169
C  1.517141 2.27774 -0.808441
C  0.115087 -1.72997 -1.138024
C  0.288479 3.132389 -0.739486
C  2.118727 2.133061 -2.171443
C  -2.890514 0.219742 -0.291147
C  -2.806081 -0.576229 0.776047
C  -3.911534 1.278108 -0.486037
C  -3.730244 -0.554161 1.93516
C  -4.625931 1.54925 0.839739
C  -4.97626 0.258737 1.579427
C  -1.794984 -0.131592 -1.22916
C  -1.640694 -1.476707 0.60181
H  4.168627 1.51446 0.134307
H  4.42522 -0.714336 -0.615464
H  5.655658 0.002927 1.264324
H  4.927039 0.284097 2.843363
H  5.069691 -1.358625 2.219387
H  2.458159 -0.055354 3.169876
H  1.386045 -0.46418 1.84469
H  2.480484 -1.678571 2.49326
H  1.494301 1.830904 1.223578
H  0.179718 -2.787579 -0.882483
H  0.145751 -1.622824 -2.221934
H  0.5302 4.176548 -0.959099
H  -0.451661 2.828289 -1.483121
H  -0.183312 3.098952 0.242833
H  1.418094 1.627255 -2.842423
H  2.318595 3.110813 -2.618046
H  3.050116 1.569333 -2.175836
H  -3.446782 2.189265 -0.870501
H  -4.623336 0.957512 -1.253637
H  -3.997893 -1.572809 2.226242
H  -3.215601 -0.120707 2.798925
H  -3.983309 2.166439 1.474229
H  -5.530532 2.129946 0.653531
H  -5.636083 -0.349801 0.954291
H  -5.53333 0.4885 2.488909
elementType: O N C H
totalener: -1094.87518382 hartree
nucrepener: 2202.09081652 hartree
electener: -3296.96600035 hartree
oneelecener: -5866.11889633 hartree
twoeener: 2569.15289598 hartree
cpcmener: -0.03041636 hartree
kineticenergy: 1090.04479117 hartree
xcener: -105.971843095239 hartree
chargesum: -0.0000000
charge: -0.251911 -0.472182 -0.409679 -0.408858 -0.086804 0.146148 -0.017148 -0.152890 -0.268871 -0.289959 -0.249232 0.418526 -0.031008 0.064970 -0.239814 -0.258374 -0.041430 -0.047242 -0.073271 -0.074320 -0.132965 -0.135744 0.271908 0.294326 0.113293 0.095190 0.086363 0.092848 0.096445 0.099555 0.080671 0.104444 0.121330 0.138805 0.130997 0.109268 0.082150 0.090904 0.094021 0.105625 0.092769 0.094806 0.102741 0.094350 0.101577 0.078035 0.080518 0.078198 0.080921
qa: -0.2519 -0.4722 -0.4097 -0.4089 -0.0868 0.1461 -0.0171 -0.1529 -0.2689 -0.2900 -0.2492 0.4185 -0.0310 0.0650 -0.2398 -0.2584 -0.0414 -0.0472 -0.0733 -0.0743 -0.1330 -0.1357 0.2719 0.2943 0.1133 0.0952 0.0864 0.0928 0.0964 0.0996 0.0807 0.1044 0.1213 0.1388 0.1310 0.1093 0.0822 0.0909 0.0940 0.1056 0.0928 0.0948 0.1027 0.0944 0.1016 0.0780 0.0805 0.0782 0.0809
va: 2.1017 2.0336 2.0940 2.1015 3.1291 3.7063 3.7950 3.8811 3.9075 3.9181 3.8367 4.0999 3.6931 3.9024 3.9194 3.9424 3.6726 3.6891 3.9168 3.9167 3.9127 3.9171 4.1919 4.1933 1.0051 1.0281 1.0055 1.0021 1.0014 0.9999 1.0050 1.0013 0.9992 0.9995 1.0069 0.9971 1.0069 1.0059 1.0040 0.9999 1.0054 1.0128 1.0052 1.0144 1.0052 1.0074 1.0097 1.0066 1.0098
dispcorr: -0.027308863 hartree
energy: -1094.902492686540
dipole: 2.91768 -4.59938 -1.68169 16.63605 -15.05113 1.58492 9.57197 -8.23558 1.33639
magnitude: 2.66946 au
magnitude: 6.78522 debye
