program: Gaussian 09
title: 000067144
version: EM64L-G09RevD.01
frameworkgroup: C1[X(C10H12O2)]
method: RPBEPBE
basis: SDD
operation: Freq
keyword: #pfreq=noraman
keyword: PBEPBE/SDD
title: #p freq=noraman PBEPBE/SDD
converged: NO YES NO NO
title: Mulliken charges:
elementType: O O C C C C C C C C C C H H H H H H H H H H H H
charge: -0.256024 -0.231506 0.298567 -0.480170 0.121573 -0.348720 -0.333658 0.327352 -0.364978 -0.353253 -0.685604 -0.537212 0.228567 0.228521 0.241842 0.279861 0.241769 0.255662 0.230831 0.206536 0.230724 0.224722 0.224724 0.249875
chargesum: 0.00000
title: Mulliken charges with hydrogens summed into heavy atoms:
elementType: O O C C C C C C C C C C
charge: -0.256024 -0.231506 0.298567 -0.023082 0.121573 -0.106879 -0.053797 0.327352 -0.123209 -0.097591 -0.017513 0.162109
polarizability: 1.86465544e+02 6.66715111e+00 1.11721905e+02 -1.59683060e-02 1.15720876e-02 6.05987992e+01
1716.lowfreq: -3.6647 -0.0005 0.0003 0.0007 0.4801 12.5638 46.9855 66.4724 83.8718
frequency: 46.9513 66.4391 83.8579 127.2661 136.2259 186.1253 224.8818 232.8539 286.9429 295.6735 300.4886 413.1840 456.7678 467.8519 487.6707 566.3303 583.5703 626.8291 701.9320 732.2824 783.1031 796.4745 818.4555 856.8346 945.5392 946.4566 983.8871 997.4457 1000.8771 1017.8828 1068.3953 1093.3915 1113.0832 1113.0995 1155.7811 1178.4725 1231.3176 1237.9708 1245.5925 1301.4582 1332.4487 1378.6974 1397.1110 1429.2253 1436.4532 1439.6768 1468.6150 1469.1649 1472.4020 1477.7636 1497.7821 1559.1869 1595.0263 1619.8180 2966.5620 2966.9028 2998.3395 3012.9654 3057.1036 3094.1935 3102.7379 3132.8429 3141.5187 3151.7326 3166.2520 3173.3081
redmass: 3.0680 3.1102 2.2789 3.6703 4.0067 1.2272 1.1726 3.2627 6.4520 3.4883 3.8185 2.9441 5.9797 4.0053 2.9321 2.0816 5.2767 6.9116 3.8178 3.0004 5.5707 1.4884 1.3349 1.5266 4.6466 1.3697 8.0430 1.3339 2.5362 1.5559 1.6532 2.6799 1.3165 1.2616 1.3236 1.2848 2.4642 3.2794 1.1877 1.2998 2.0939 5.2204 1.2102 4.1131 1.1515 1.1313 1.0390 1.0494 1.0787 1.0528 2.4777 7.1048 8.2087 6.3751 1.0340 1.0587 1.0364 1.0982 1.1042 1.1002 1.0998 1.0996 1.0878 1.0882 1.0951 1.0971
irintensity: 0.1450 0.6048 1.3834 0.2279 8.2239 0.0314 0.1384 2.2523 3.0736 2.0308 16.7725 0.0180 0.4216 1.5974 6.4527 10.3627 26.4568 0.7836 2.8693 1.4901 1.2314 59.1022 0.0145 40.0398 59.7169 0.0647 44.9949 0.1548 5.0462 9.8205 1.5032 2.0277 17.5012 0.9943 9.9994 181.9113 137.6545 195.9417 0.1708 0.2301 89.1396 8.1987 30.2961 42.0446 9.4221 13.1490 12.1431 13.7973 38.9859 15.0941 23.6037 155.3577 116.4270 126.9847 81.2522 17.9198 33.2485 11.9154 44.5778 28.5848 31.9885 24.7391 7.6496 0.0658 13.9878 6.2428
temp: 298.150 k
press: 1.00000 atm
elementType: 8 8 6 6 6 6 6 6 6 6 6 6 1 1 1 1 1 1 1 1 1 1 1 1
symmnumber: 1
zpe: 511089.4 jmol-1
zpe.correction: 0.194664 hartree
zpe.thermalcorrener: 0.206712 hartree
zpe.thermalcorrenthalpy: 0.207656 hartree
zpe.thermalcorrgfe: 0.156052 hartree
zpe.sumelectzpe: -537.807290 hartree
zpe.sumelectthermal: -537.795242 hartree
zpe.sumelectthermalent: -537.794298 hartree
zpe.sumelectthermalfe: -537.845901 hartree
dipole: -3.3028 -4.2102 -0.0023
dipole: 5.3511
quadrupole: -66.4881 -68.1504 -73.4183
quadrupole: -1.0400 -0.0108 -0.0055
quadrupole: 2.8641 1.2019 -4.0660 -1.0400 -0.0108 -0.0055
hfenergy: -538.0019535 hartree
pointgroup: C01 [X(C10H12O2)]
dipole: 1.2857619 1.6670335 0.0026559 debye
dipolederiv: -1.9176315 -0.353128 -0.0022541 -0.2069007 -0.3672927 -0.0003327 -0.0021743 -0.0005086 -0.2957287 -1.0288196 -0.1191781 -0.0008889 -0.4605358 -0.7489635 -0.0012951 -0.0000512 0.0000117 -0.3059081 -1.1130787 -0.0432529 -0.0008484 0.1117515 -0.2205178 -0.0002006 -0.0011463 -0.0001409 -0.0454541 -0.1108898 0.1077867 0.0000993 0.3274981 -0.2768134 -0.0006959 0.0016832 -0.0013964 0.156329 1.9563784 -0.0073237 0.0013962 0.0353936 0.8385408 0.001248 0.0005367 0.0007324 0.1054829 0.4028486 0.0695963 0.0007341 0.1536607 0.1066053 0.0005406 0.0002066 0.0003428 -0.1183096 0.3065 0.0406753 0.000587 -0.2030607 0.0888995 0.0001234 0.0001225 0.0002293 -0.0961366 1.7468831 0.2021171 0.0020708 -0.1478077 0.1213052 -0.0001536 0.0015741 0.0002535 0.119763 -0.5792763 -0.0111338 -0.0003575 0.4574777 -0.0275923 0.0007833 0.0002763 0.0002855 -0.2098144 -0.4821051 -0.1336595 -0.0004755 -0.3964172 -0.0121893 -0.0002163 -0.0008922 0.0000692 -0.1816759 -0.0443653 -0.0175424 0.0000195 0.0043317 0.0903369 0.0002061 0.0001256 0.00023 0.0608535 0.6398452 0.1766968 0.0005867 0.5663425 0.4457936 0.0007933 0.0011321 0.0003787 0.3212197 -0.0227709 -0.0310729 -0.0845443 -0.0438381 0.0317691 -0.0740588 -0.0883976 -0.0892743 -0.0332331 -0.0223352 -0.0314518 0.0842995 -0.0442502 0.0310918 0.0745861 0.0877933 0.0898312 -0.0328066 0.0601311 0.0883571 0.0000171 0.1055478 -0.0396426 -0.0001617 0.0000716 -0.0001478 0.1362049 0.1084148 -0.0834441 -0.0002245 -0.0244653 0.0171874 -0.0002491 -0.0001631 -0.0002424 0.1492863 0.0222848 -0.0852351 -0.000276 -0.1007824 -0.0383365 -0.000429 -0.0002171 -0.0004492 0.1671182 0.0311091 0.0802014 -0.0000199 0.0762719 -0.0048665 -0.0001626 0.0000158 -0.0001531 0.1694856 0.0598219 -0.0135142 0.0317931 -0.0813137 0.0476536 0.1049403 0.0627573 0.0846472 -0.0629951 -0.0394185 0.0974009 0.0002075 0.1760699 -0.1161087 -0.0005587 0.0004437 -0.0005837 0.1014158 0.0594326 -0.013517 -0.0320456 -0.0810954 0.0484254 -0.1044961 -0.0634079 -0.0842443 -0.0639058 0.059851 0.03398 0.0750149 -0.1417352 -0.0470661 -0.0956451 0.0021322 -0.1081369 -0.0835886 0.0600461 0.0339567 -0.0746004 -0.1419437 -0.0476412 0.0954324 -0.0021965 0.1083189 -0.0831868 -0.1528556 0.0126849 -0.0002909 0.059801 0.0794221 0.0000016 -0.0002248 -0.0000528 0.1255842 unknown
polarizability: 186.3509235|7.2797276|111.8363187|0.1277013|0.0722982|60.5990068 unknown
InChI: InChI=1S/C10H12O2/c1-3-10(11)8-4-6-9(12-2)7-5-8/h4-7H,3H2,1-2H3
charge 0 multiplicity 1
24 atoms
O  3.551789 -0.222115 0.00202
O  -2.765658 -1.369157 -0.004207
C  -0.683152 -0.164817 -0.0030
C  -2.989255 1.059599 -0.002433
C  -2.179509 -0.244429 -0.004954
C  0.025876 1.064183 -0.000311
C  0.065446 -1.378885 -0.003762
C  2.157934 -0.124659 0.000546
C  1.435534 1.096452 0.001479
C  1.464924 -1.365644 -0.002068
C  -4.509667 0.828682 -0.002037
C  4.328382 1.022802 0.004676
H  -2.68877 1.657829 0.88253
H  -2.689542 1.661369 -0.885137
H  -0.519301 2.013913 0.000451
H  -0.490891 -2.321935 -0.005753
H  1.955721 2.058582 0.003578
H  2.050036 -2.290018 -0.002726
H  -4.818851 0.247693 0.883329
H  -5.049029 1.792753 0.00049
H  -4.820012 0.251803 -0.889705
H  4.119146 1.623254 0.910705
H  4.121167 1.625817 -0.900114
H  5.379784 0.702128 0.005404
