program: Orca
programVersion: 5.0.2
elementType: O O O O N C C C C C C C C C C C C C C C C C C C H H H H H H H H H H H H H H H H H H H H H H H H H
charge: 0
multiplicity: 1
keywords: wb97x-d3
keywords: def2-TZVPP
keywords: def2/J RIJCOSX
keywords: DEFGRID2
keywords: scfconv7
keywords: smallprint printgap noloewdin
keywords: NOSOSCF
formula: C19H25NO4
InChI: InChI=1/C19H25NO4/c1-11(2)9-14-15(19(14,3)4)18(23)24-10-20-16(21)12-7-5-6-8-13(12)17(20)22/h9,14-15H,5-8,10H2,1-4H3
49 atoms
O  1.014448 -0.942776 -0.768736
O  2.535266 -1.624639 -2.240184
O  -1.585717 -3.092644 0.094859
O  -1.475623 1.154005 -1.517402
N  -1.255818 -1.077335 -0.978793
C  3.159994 -0.240716 1.198357
C  3.330526 0.883451 0.221267
C  3.297772 -0.571645 -0.27156
C  4.374432 -0.599776 2.024357
C  1.875517 -0.416805 1.972805
C  2.265512 1.84718 -0.110101
C  2.265875 -1.095891 -1.185444
C  2.432665 3.155652 -0.335856
C  -0.033306 -1.355518 -1.644686
C  1.260207 4.016531 -0.700779
C  3.743659 3.881954 -0.282634
C  -3.036115 -1.193542 0.476237
C  -2.9979 0.056306 0.011893
C  -4.047001 -1.723198 1.422024
C  -3.944894 1.134053 0.386088
C  -5.216429 -0.741884 1.519463
C  -4.741768 0.706326 1.619711
C  -1.904531 -1.950908 -0.111606
C  -1.848919 0.178412 -0.91802
H  4.334737 1.289967 0.178781
H  4.27249 -0.94542 -0.563852
H  5.302974 -0.473257 1.465857
H  4.43375 0.031305 2.913303
H  4.327305 -1.638928 2.357286
H  0.997615 0.017166 1.503541
H  1.670594 -1.472998 2.156434
H  1.986851 0.064015 2.946991
H  1.25402 1.466524 -0.186674
H  0.029637 -2.422707 -1.854848
H  0.009296 -0.80341 -2.583482
H  1.431804 4.526059 -1.653213
H  0.337459 3.442882 -0.791188
H  1.099168 4.802294 0.04245
H  3.627733 4.83906 0.232373
H  4.532708 3.32978 0.224829
H  4.095725 4.115446 -1.291695
H  -4.389996 -2.708875 1.098651
H  -3.581144 -1.873409 2.401342
H  -3.406258 2.0663 0.572042
H  -4.613048 1.336281 -0.457396
H  -5.852884 -0.853918 0.637048
H  -5.833488 -0.994058 2.382925
H  -4.116548 0.821895 2.509663
H  -5.595773 1.372359 1.750543
elementType: O N C H
totalener: -1094.87545337 hartree
nucrepener: 2142.12825892 hartree
electener: -3237.00371228 hartree
oneelecener: -5746.03549238 hartree
twoeener: 2509.03178009 hartree
cpcmener: -0.03122849 hartree
kineticenergy: 1090.04334586 hartree
xcener: -105.971605718735 hartree
chargesum: 0.0000000
charge: -0.259548 -0.468353 -0.406604 -0.411719 -0.097337 0.125710 0.027615 -0.119342 -0.267888 -0.266511 -0.279290 0.405498 -0.033574 0.065856 -0.217207 -0.267329 -0.067185 -0.046732 -0.071231 -0.073711 -0.137157 -0.135495 0.309519 0.296178 0.109604 0.096891 0.087095 0.093866 0.094651 0.082280 0.103586 0.094210 0.101899 0.130478 0.138142 0.092210 0.081112 0.093177 0.092625 0.091284 0.103155 0.093714 0.101568 0.093979 0.101439 0.078167 0.081085 0.078619 0.081000
qa: -0.2595 -0.4684 -0.4066 -0.4117 -0.0973 0.1257 0.0276 -0.1193 -0.2679 -0.2665 -0.2793 0.4055 -0.0336 0.0659 -0.2172 -0.2673 -0.0672 -0.0467 -0.0712 -0.0737 -0.1372 -0.1355 0.3095 0.2962 0.1096 0.0969 0.0871 0.0939 0.0947 0.0823 0.1036 0.0942 0.1019 0.1305 0.1381 0.0922 0.0811 0.0932 0.0926 0.0913 0.1032 0.0937 0.1016 0.0940 0.1014 0.0782 0.0811 0.0786 0.0810
va: 2.1122 2.0359 2.1102 2.0928 3.1323 3.6716 3.7411 3.8617 3.9150 3.9049 3.8970 4.1296 3.7492 3.9029 3.9218 3.9346 3.6802 3.6711 3.9156 3.9192 3.9162 3.9134 4.2042 4.1898 1.0061 1.0268 1.0055 1.0020 1.0015 1.0060 1.0021 1.0024 1.0074 1.0056 0.9998 0.9956 1.0151 0.9969 0.9980 1.0098 0.9944 1.0155 1.0053 1.0156 1.0047 1.0065 1.0097 1.0069 1.0096
dispcorr: -0.024439858 hartree
energy: -1094.899893225424
dipole: 6.00084 -7.57753 -1.57669 17.78175 -16.63783 1.14392 15.28219 -13.44134 1.84085
magnitude: 2.68015 au
magnitude: 6.81240 debye
