program: Gaussian 09
title: 000067183
version: EM64L-G09RevD.01
frameworkgroup: C1[X(C11H11N3O3S2)]
method: RPBEPBE
basis: SDD
operation: Freq
keyword: #p
keyword: freq=noraman
keyword: PBEPBE/SDD
title: #p freq=noraman PBEPBE/SDD
converged: YES YES NO NO
title: Mulliken charges:
elementType: S S O O O N N N C C C C C C C C C C C H H H H H H H H H H H
charge: 0.928774 0.262165 -0.532149 -0.494067 -0.243748 -0.437642 -0.455201 0.000813 -0.083254 -0.180523 -0.223328 0.503594 -0.328035 -0.424551 -0.135302 0.231154 -0.480611 -0.153070 -0.778089 0.283974 0.286964 0.320574 0.232729 0.312134 0.308545 0.273161 0.262214 0.264528 0.263058 0.215188
chargesum: 0.00000
title: Mulliken charges with hydrogens summed into heavy atoms:
elementType: S S O O O N N N C C C C C C C C C C C
charge: 0.928774 0.262165 -0.532149 -0.494067 -0.243748 -0.125509 -0.146656 0.000813 -0.083254 0.103451 0.063637 0.503594 -0.007462 -0.191821 -0.135302 0.231154 -0.207450 0.109143 -0.035314
polarizability: 3.39824589e+02 2.11259399e+01 2.24030951e+02 -2.75160002e+00 -2.11410637e+01 1.17265330e+02
1716.lowfreq: -7.5345 -2.8500 -0.0009 0.0017 0.0018 1.3896 14.3496 22.5035 33.0813
frequency: 12.7919 22.4778 33.0579 36.2344 53.7586 70.2639 75.8296 99.3125 101.4138 145.7447 168.8666 175.7936 184.6788 210.9031 294.7755 302.9103 326.5373 343.5765 374.3920 383.5498 410.7386 412.2662 443.7394 499.0775 525.6590 533.3449 547.5113 590.1660 596.1136 616.9581 625.6488 653.0962 674.3655 706.4141 728.1543 731.2931 778.7579 810.7984 824.5731 832.0143 841.8378 858.7013 873.8991 929.6715 945.2083 964.0431 984.2343 993.5122 994.2558 1002.8071 1040.1417 1053.3769 1074.3638 1124.5347 1185.1372 1214.5984 1219.5312 1263.6779 1265.2193 1297.8398 1300.6076 1370.9409 1390.9091 1408.2906 1423.4205 1448.1437 1469.0978 1475.9312 1489.3703 1501.5490 1593.0185 1599.4768 1633.0212 2998.0075 3097.0416 3104.2761 3126.8376 3167.5842 3172.0335 3200.2276 3200.3459 3246.3607 3414.8031 3533.2554
redmass: 4.3563 7.0682 5.9504 1.2459 4.1268 6.3138 5.5670 6.8032 6.6539 10.3199 6.8661 7.2402 8.2400 7.3108 7.2611 6.7931 7.6715 6.2224 4.6347 5.6336 3.3102 5.6716 5.5856 4.6109 2.9232 6.6831 4.4315 6.3688 3.1019 6.6983 5.2224 1.1963 6.1050 2.6620 3.0092 1.6654 2.2041 6.0630 5.0743 1.3656 5.1479 1.5217 1.3442 6.3828 12.2776 1.3627 4.3094 1.3652 1.7017 3.1791 1.6432 2.3935 1.2627 1.3210 1.1265 3.3989 1.2581 2.4735 1.8649 2.2737 1.4423 4.0758 1.2295 4.6082 5.0307 1.0463 1.1627 2.0696 5.9406 2.2426 6.7256 5.7141 4.9185 1.0364 1.0993 1.0992 1.0902 1.0951 1.0915 1.0935 1.0938 1.1005 1.0767 1.0766
irintensity: 3.3263 0.3760 2.4363 1.7770 0.1532 4.3054 3.9214 1.3726 1.8049 5.0326 11.3263 8.1815 4.7484 5.5789 18.4922 12.8299 12.6268 63.5316 9.6292 8.0990 2.4652 12.2084 91.1768 17.9314 63.1331 7.7151 67.8045 4.1979 2.1392 3.7285 35.1699 56.7962 3.1914 63.4517 3.3323 32.9117 145.8622 106.0852 20.7102 25.4862 4.9438 59.9054 1.6876 5.4201 46.2330 1.0807 6.5661 3.8754 20.2232 101.2258 15.6873 53.2507 5.7081 13.1318 48.8435 80.5010 23.7549 18.3369 70.0295 9.0724 55.8387 253.3934 47.8784 16.0849 45.0941 16.2348 16.3196 46.8455 19.9510 455.7601 113.6321 35.5351 102.1271 10.7386 12.5673 10.2246 16.0268 6.4076 6.5104 8.1963 10.3467 1.0642 31.2343 17.4630
temp: 298.150 k
press: 1.00000 atm
elementType: 16 16 8 8 8 7 7 7 6 6 6 6 6 6 6 6 6 6 6 1 1 1 1 1 1 1 1 1 1 1
symmnumber: 1
zpe: 546984.7 jmol-1
zpe.correction: 0.208335 hartree
zpe.thermalcorrener: 0.227769 hartree
zpe.thermalcorrenthalpy: 0.228713 hartree
zpe.thermalcorrgfe: 0.156129 hartree
zpe.sumelectzpe: -1610.266785 hartree
zpe.sumelectthermal: -1610.247351 hartree
zpe.sumelectthermalent: -1610.246407 hartree
zpe.sumelectthermalfe: -1610.318991 hartree
dipole: 4.1548 -0.7514 -3.9496
dipole: 5.7816
quadrupole: -85.1271 -129.7805 -131.3571
quadrupole: 22.6732 -7.3136 -7.2919
quadrupole: 30.2945 -14.3589 -15.9356 22.6732 -7.3136 -7.2919
hfenergy: -1610.4751203 hartree
pointgroup: C01 [X(C11H11N3O3S2)]
dipole: -1.7278539 -0.195805 1.4663451 debye
polarizability: 328.907253|-41.1595539|227.8943828|5.1651028|33.247114|124.3192339 unknown
InChI: InChI=1S/C11H11N3O3S2/c1-8(15)13-9-2-4-10(5-3-9)19(16,17)14-11-12-6-7-18-11/h2-7,13-14H,1H3
charge 0 multiplicity 1
30 atoms
S  1.985638 1.348917 -0.164899
S  4.965032 -1.726289 0.667367
O  2.37604 2.794229 0.482682
O  2.444547 0.910071 -1.661764
O  -4.526686 -1.177998 -0.977636
N  2.737125 0.014086 1.19366
N  -4.010331 0.63122 0.429111
N  2.355805 -2.072535 0.072356
C  0.144243 1.091334 0.012209
C  -0.466791 0.055029 -0.711843
C  -0.557385 1.960698 0.864266
C  -2.606349 0.745944 0.257534
C  -1.859748 -0.11892 -0.59226
C  -1.946922 1.782641 0.978347
C  3.154457 -1.182406 0.664415
C  -4.894323 -0.281888 -0.16616
C  4.413381 -3.225705 -0.12769
C  3.044367 -3.190434 -0.374943
C  -6.355069 -0.105616 0.238283
H  0.127891 -0.603109 -1.351745
H  -0.033763 2.758227 1.399942
H  -2.375635 -0.909945 -1.138126
H  -2.52283 2.451747 1.629328
H  3.460866 0.576688 1.674748
H  -4.430434 1.307794 1.070326
H  5.112203 -4.034671 -0.329821
H  2.487601 -3.99043 -0.864331
H  -6.739452 -1.069223 0.612929
H  -6.945903 0.15398 -0.657449
H  -6.520576 0.667962 1.007964
