program: Gaussian 09
title: 000067141
version: EM64L-G09RevD.01
frameworkgroup: C1[X(C7H6S2)]
method: RPBEPBE
basis: SDD
operation: Freq
keyword: #p
keyword: freq=noraman
keyword: PBEPBE/SDD
title: #p freq=noraman PBEPBE/SDD
converged: YES YES NO NO
title: Mulliken charges:
elementType: S S C C C C C C C H H H H H H
charge: 0.044479 0.092604 0.686991 -0.355365 -0.324735 -0.215972 -0.224954 -0.228496 -0.847660 0.269364 0.243202 0.234636 0.234345 0.236608 0.154953
chargesum: 0.00000
title: Mulliken charges with hydrogens summed into heavy atoms:
elementType: S S C C C C C C C
charge: 0.199432 0.092604 0.686991 -0.086001 -0.081533 0.018664 0.009391 0.008112 -0.847660
polarizability: 1.65133842e+02 6.45728130e+00 1.27567427e+02 5.17367057e-01 -3.34668019e-01 3.92219162e+01
1716.lowfreq: -9.4678 -6.6646 -2.6938 -0.0034 -0.0025 -0.0016 11.7892 136.6435 184.3929
frequency: 11.4804 136.6428 184.3929 273.9142 347.1664 353.9785 397.4105 403.8804 412.4434 582.3783 611.5401 625.1929 685.5717 785.8537 804.7276 848.7108 886.9797 943.9816 987.7422 988.3365 1006.6902 1012.7422 1035.6539 1102.8679 1175.7061 1198.7538 1263.9961 1323.4758 1384.0997 1435.7653 1475.0863 1577.3918 1602.5032 2443.4337 3131.3800 3138.3852 3148.7737 3158.1549 3170.7341
redmass: 5.3101 4.7506 7.4814 9.7412 1.2813 4.4548 2.7002 5.5859 4.5906 4.4352 6.4942 7.1543 1.6964 1.8818 1.9166 1.2584 2.5576 1.4408 1.4267 5.4789 1.3468 4.3944 2.0034 1.6824 1.0548 1.1229 4.2913 1.3456 7.6788 2.3482 2.1645 5.6545 5.9472 1.0377 1.0852 1.0880 1.0923 1.0962 1.1017
irintensity: 0.0348 0.9534 0.6039 2.9811 33.5127 8.9203 5.3009 0.1734 0.7889 0.8990 3.8196 38.3913 47.5995 68.2038 63.0714 0.3813 57.7423 5.9857 0.9088 1.7564 0.5338 55.7069 26.5213 0.9440 0.5385 15.0932 141.1725 11.4637 1.1168 25.7682 0.0750 0.2131 24.3314 3.1294 0.4773 4.7080 8.3536 18.3424 25.6218
temp: 298.150 k
press: 1.00000 atm
elementType: 16 16 6 6 6 6 6 6 6 1 1 1 1 1 1
symmnumber: 1
zpe: 275487.5 jmol-1
zpe.correction: 0.104928 hartree
zpe.thermalcorrener: 0.113227 hartree
zpe.thermalcorrenthalpy: 0.114171 hartree
zpe.thermalcorrgfe: 0.069507 hartree
zpe.sumelectzpe: -1065.819680 hartree
zpe.sumelectthermal: -1065.811380 hartree
zpe.sumelectthermalent: -1065.810436 hartree
zpe.sumelectthermalfe: -1065.855101 hartree
dipole: -2.2268 -1.2087 -0.0229
dipole: 2.5338
quadrupole: -57.1817 -64.7531 -71.8164
quadrupole: -3.7179 -0.0326 -0.8378
quadrupole: 7.4021 -0.1694 -7.2327 -3.7179 -0.0326 -0.8378
hfenergy: -1065.9246074 hartree
pointgroup: C01 [X(C7H6S2)]
dipole: -0.8718346 -0.4689933 -0.1170212 debye
dipolederiv: -0.1854289 0.342624 0.1488802 0.4374805 -0.558601 -0.2185459 0.188975 -0.1983071 -0.1697745 -0.5173205 -0.2487086 -0.0739594 -0.1876873 -0.6345907 -0.2015958 -0.0333031 -0.1856983 -0.1784189 -0.7474027 0.0036577 0.0546321 0.0055556 -0.1101544 -0.085085 0.0530174 -0.0777787 0.0891546 0.0888136 0.1190243 0.0156562 -0.1764864 -0.0056896 0.0358223 -0.0881834 0.0250925 -0.1030793 0.1656854 -0.0820756 -0.0338835 0.1242238 0.000171 0.0254304 0.0454036 0.0376775 -0.1261261 -0.1355707 -0.174898 -0.0466357 -0.2224122 0.0389493 0.0620787 -0.0610498 0.0610905 -0.1222758 -0.228665 0.1309584 0.0373666 0.2564023 0.0785643 0.0487969 0.0782649 0.0577535 -0.1383381 0.1295057 0.0076333 -0.0131001 -0.0307928 0.0097888 0.0395695 -0.0228104 0.0376347 -0.1223057 1.3543914 -0.0503133 -0.1227084 -0.1302059 1.0484089 0.5303161 -0.158769 0.4952767 -0.0252111 0.1134948 -0.0970242 -0.0236231 -0.0277331 0.0298435 -0.0280155 0.0026115 -0.0325761 0.1411355 0.0490382 0.0957404 0.0352537 0.0858469 0.0237054 -0.0393284 0.0197078 -0.0480489 0.1458527 0.0073754 0.0779999 0.0297943 0.0999116 -0.0332005 -0.0574387 0.0374356 -0.0555483 0.1408813 0.0246238 -0.0744982 -0.0131089 -0.0980009 -0.0532962 -0.0520313 -0.0214161 -0.0525993 0.1463159 -0.1198636 -0.0120876 0.0121724 -0.0113242 0.1025918 -0.0142511 0.0122858 -0.0156662 0.1536898 0.001323 -0.0380327 -0.0067362 -0.124778 0.0635096 -0.0457223 -0.0521697 -0.0483024 0.1684996 unknown
polarizability: 164.6821352|8.5132181|118.8285272|-4.214261|26.4620354|48.4125232 unknown
InChI: InChI=1S/C7H6S2/c8-7(9)6-4-2-1-3-5-6/h1-5,8H
charge 0 multiplicity 1
15 atoms
S  2.590032 -1.286678 -0.764785
S  2.641516 1.574386 0.358378
C  0.268603 0.106779 -0.066428
C  -0.506071 1.249986 0.292906
C  -0.416441 -1.10926 -0.363866
C  -1.910355 1.1784 0.350973
C  -1.822412 -1.17745 -0.302696
C  -2.57638 -0.035102 0.053823
C  1.748287 0.214282 -0.117775
H  0.018919 2.183457 0.520814
H  0.146722 -2.009425 -0.633326
H  -2.488223 2.067164 0.626424
H  -2.330778 -2.120423 -0.530417
H  -3.669604 -0.089822 0.100317
H  3.863186 -0.767194 -0.612244
