program: Gaussian 09
title: 000067318
version: EM64L-G09RevD.01
frameworkgroup: C1[X(C20H25NO5)]
method: RPBEPBE
basis: SDD
operation: Freq
keyword: #p
keyword: freq=noraman
keyword: PBEPBE/SDD
title: #p freq=noraman PBEPBE/SDD
converged: YES YES NO NO
title: Mulliken charges:
elementType: O O O O O N C C C C C C C C C C C C C C C C C C C C H H H H H H H H H H H H H H H H H H H H H H H H H
charge: -0.257878 -0.253400 -0.290103 -0.244437 -0.237030 -0.357726 -0.585082 -0.385205 0.538561 -0.653535 0.453252 0.216256 -0.518221 -0.450467 0.203577 0.194708 -0.487183 -0.335290 -0.440340 0.214451 0.182280 -0.336693 -0.542046 -0.542420 -0.550465 -0.539152 0.257446 0.210772 0.246447 0.210416 0.247398 0.231328 0.342431 0.269122 0.230792 0.253186 0.241092 0.236622 0.242144 0.231779 0.212970 0.245475 0.245086 0.222261 0.220879 0.271188 0.214060 0.235638 0.247439 0.217436 0.220181
chargesum: 0.00000
title: Mulliken charges with hydrogens summed into heavy atoms:
elementType: O O O O O N C C C C C C C C C C C C C C C C C C C C
charge: -0.257878 -0.253400 -0.290103 -0.244437 -0.237030 -0.015296 -0.116864 0.071659 0.538561 -0.174809 0.453252 0.216256 -0.249099 -0.219675 0.203577 0.194708 -0.233996 -0.094198 -0.203718 0.214451 0.182280 -0.094549 0.148178 0.145806 0.170421 0.145904
polarizability: 2.25970327e+02 9.02139916e+00 2.84043204e+02 1.43943649e+01 3.64754777e+00 2.15037823e+02
1716.lowfreq: -4.5849 -0.0006 -0.0005 -0.0003 1.4741 6.4935 8.0741 25.3484 30.0223
frequency: 3.5158 25.1714 30.0058 40.0828 44.7303 49.9754 71.0130 90.2939 94.8967 96.5925 103.1248 120.7390 151.0344 157.7626 178.8738 180.2569 191.6881 205.7320 215.0248 225.2671 235.5103 246.2572 254.5618 268.0563 281.6768 312.3992 335.7042 343.3163 352.0688 361.3629 371.8825 376.7816 423.9127 457.3991 458.9769 477.0490 479.6266 531.4767 552.0593 559.2834 575.8684 584.2966 592.3633 606.0149 633.7556 665.4137 693.5686 721.3539 728.7935 731.7491 734.8098 748.2793 794.2340 804.3766 822.7176 853.9767 869.8009 877.5595 902.1613 909.2322 917.0947 918.7276 936.9081 957.9908 983.6571 984.2704 996.4653 1002.9452 1043.4130 1088.8043 1102.5416 1111.9628 1112.7264 1112.8616 1127.6129 1130.6322 1141.8941 1142.4086 1153.8827 1156.8615 1174.8636 1176.3193 1179.3134 1194.0208 1218.9442 1220.9449 1228.9633 1256.9483 1260.7468 1266.3722 1276.2263 1283.4261 1294.9664 1318.3216 1355.5416 1393.1768 1393.9805 1408.3683 1409.9862 1436.3545 1436.8420 1442.5428 1442.8147 1446.0676 1448.1929 1464.9782 1466.2647 1467.1639 1467.8162 1468.8809 1471.2164 1471.8162 1473.6964 1476.3517 1498.7237 1507.1028 1508.7687 1586.5651 1591.7479 1603.9898 1609.8842 1613.0912 2955.0762 2955.7138 2957.1166 2975.4915 2994.1085 3001.1115 3004.9197 3041.6667 3043.9261 3044.2940 3053.6336 3059.1441 3076.7136 3077.8789 3123.0915 3124.7441 3124.9635 3125.3153 3130.8801 3132.9556 3147.9980 3150.5388 3160.5850 3165.8562 3530.1225
redmass: 4.6458 5.5029 4.7323 4.2676 5.9545 5.1821 4.0423 3.6211 3.3775 3.6917 3.1999 4.0497 4.0233 3.5471 3.1511 3.5266 2.0298 2.1400 2.1674 2.3618 1.5049 1.2821 1.3574 1.8235 2.1795 4.3035 3.1633 3.2917 3.6577 3.2505 4.5081 4.6362 4.0227 3.5173 3.3785 5.8811 4.2130 5.0428 4.4215 2.9585 3.7722 2.8578 3.0474 1.9054 3.4176 4.0654 3.5563 4.6092 5.0922 4.2966 3.4201 3.6521 1.5500 1.5237 2.2812 1.6398 3.2800 1.8506 2.1472 2.5059 1.4121 1.4819 3.0067 3.6337 8.2732 8.1692 4.0895 3.5177 1.9502 5.4086 1.2717 1.2629 1.2606 1.2603 2.2438 1.9902 1.5876 1.5589 1.4220 1.4032 1.4442 1.5491 1.2336 1.2437 2.0265 2.0216 1.7795 1.9028 3.4242 2.0222 1.4198 1.5027 1.9242 1.2446 1.3429 4.3653 4.6729 2.9341 2.7230 1.1801 1.1788 1.3455 1.2005 1.2359 1.1222 1.0548 1.0518 1.0643 1.0511 1.0767 1.0862 1.0703 1.0574 1.1489 1.8470 2.6377 2.5785 7.0989 7.1242 6.8124 6.8913 6.6464 1.0332 1.0340 1.0333 1.0348 1.0613 1.0607 1.0607 1.1037 1.1032 1.1027 1.0998 1.1024 1.0999 1.1024 1.0919 1.0973 1.0988 1.0985 1.0896 1.1011 1.0903 1.0905 1.0940 1.0937 1.0780
irintensity: 0.2881 1.4407 0.3201 0.1675 8.1308 0.6767 4.7729 9.5665 4.4042 17.4688 0.2393 0.5663 0.1261 0.2716 5.2286 3.8688 2.8795 0.6944 0.7620 0.4768 1.4917 0.4002 0.5028 0.5868 0.8899 6.3003 2.4613 2.6922 0.7131 3.6520 12.2116 4.4815 3.5092 1.5063 5.4043 1.0759 1.1614 9.0654 8.3418 37.9567 4.7493 25.0209 9.3821 24.9151 17.7092 18.1454 10.8016 5.6845 15.7870 8.4975 2.0925 5.2267 43.0310 29.2107 2.6346 19.0668 2.5738 12.4715 13.7016 12.2937 0.0448 0.6565 3.0415 2.7225 34.0258 39.3432 39.9645 35.5631 6.9331 4.4824 2.4689 0.5847 0.1951 0.3644 123.2044 130.1268 11.1127 5.2621 10.9281 9.6985 12.4284 18.6123 6.7206 2.3507 105.8013 68.7701 48.0019 70.1104 140.7265 66.4911 10.1209 15.0598 35.0804 23.5338 12.2228 10.0150 6.9904 19.9446 15.8936 9.2469 17.4185 5.1303 24.4668 40.2643 5.2459 38.7032 6.3056 35.2123 16.2910 9.6065 28.4719 58.4630 43.3451 33.7175 121.1796 113.4394 162.4890 39.4519 42.2993 80.3691 163.9522 19.2320 77.6085 98.4962 24.5330 39.5160 14.9529 19.3395 73.5318 49.2955 1.5035 110.9286 8.0292 10.3056 24.0743 17.7465 33.7743 2.9208 24.4693 18.7438 11.9375 17.8866 8.8614 6.9181 11.0630 12.5249 47.3085
temp: 298.150 k
press: 1.00000 atm
elementType: 8 8 8 8 8 7 6 6 6 6 6 6 6 6 6 6 6 6 6 6 6 6 6 6 6 6 1 1 1 1 1 1 1 1 1 1 1 1 1 1 1 1 1 1 1 1 1 1 1 1 1
symmnumber: 1
zpe: 1087401.2 jmol-1
zpe.correction: 0.414169 hartree
zpe.thermalcorrener: 0.441159 hartree
zpe.thermalcorrenthalpy: 0.442103 hartree
zpe.thermalcorrgfe: 0.353750 hartree
zpe.sumelectzpe: -1206.002746 hartree
zpe.sumelectthermal: -1205.975756 hartree
zpe.sumelectthermalent: -1205.974811 hartree
zpe.sumelectthermalfe: -1206.063164 hartree
dipole: -1.4356 -1.9123 -2.7163
dipole: 3.6188
quadrupole: -141.0806 -162.7552 -138.4910
quadrupole: -10.6391 3.2813 -1.2462
quadrupole: 6.3617 -15.3130 8.9513 -10.6391 3.2813 -1.2462
hfenergy: -1206.4169149 hartree
pointgroup: C01 [X(C20H25N1O5)]
dipole: -0.4576598 0.770951 1.1060096 debye
polarizability: 223.7740291|-3.4476273|284.8669652|-14.456229|6.6703305|216.41036 unknown
InChI: InChI=1S/C20H25NO5/c1-23-16-7-5-14(11-18(16)25-3)9-10-21-20(22)13-15-6-8-17(24-2)19(12-15)26-4/h5-8,11-12,21H,9-10,13H2,1-4H3
charge 0 multiplicity 1
51 atoms
O  2.511666 1.100095 -2.012422
O  2.87307 2.864128 -0.06093
O  0.522233 -3.994041 -1.039717
O  -1.807931 2.532046 -0.463771
O  -4.06445 2.123633 0.857267
N  -0.061137 -2.572552 0.704454
C  2.424276 -2.745096 1.224416
C  0.956321 -3.083541 1.637314
C  2.627965 -1.269394 0.930662
C  -1.296783 -2.390849 -1.446048
C  -2.051519 -1.2209 -0.836827
C  -0.197772 -3.051793 -0.577271
C  2.533313 -0.806327 -0.408725
C  2.839226 -0.324041 1.956753
C  2.62146 0.566482 -0.717749
C  2.816752 1.517901 0.333765
C  -1.543364 0.104519 -0.948315
C  2.934096 1.05789 1.663041
C  -3.262103 -1.42195 -0.139241
C  -2.22596 1.203862 -0.383477
C  -3.452281 0.981483 0.32845
C  -3.955584 -0.331915 0.441437
C  2.446623 0.144677 -3.121963
C  3.100799 3.855212 0.992969
C  -0.586774 2.814744 -1.232072
C  -5.330839 1.932621 1.566715
H  2.669113 -3.35266 0.336009
H  3.080948 -3.078817 2.051113
H  0.86067 -4.18348 1.702635
H  0.734942 -2.654153 2.63086
H  -1.993099 -3.206911 -1.715503
H  -0.797675 -2.096925 -2.388465
H  -0.629091 -1.766388 0.974822
H  2.383283 -1.543484 -1.204406
H  2.931293 -0.659496 2.996704
H  -0.60362 0.271676 -1.485139
H  3.098817 1.769716 2.47739
H  -3.675871 -2.432908 -0.049414
H  -4.893653 -0.516802 0.972906
H  3.335119 -0.515251 -3.135614
H  1.531135 -0.478766 -3.074746
H  2.426209 0.764473 -4.030319
H  3.120532 4.82404 0.472763
H  4.069506 3.685416 1.502501
H  2.282646 3.847924 1.739812
H  0.303752 2.341732 -0.783065
H  -0.690953 2.483714 -2.283506
H  -0.478782 3.908299 -1.196774
H  -5.632403 2.941428 1.884158
H  -5.203735 1.283422 2.455588
H  -6.105685 1.502304 0.902076
