program: Orca
programVersion: 5.0.2
elementType: O O O O N C C C C C C C C C C C C C C C C C C C H H H H H H H H H H H H H H H H H H H H H H H H H
charge: 0
multiplicity: 1
keywords: wb97x-d3
keywords: def2-TZVPP
keywords: def2/J RIJCOSX
keywords: DEFGRID2
keywords: scfconv7
keywords: smallprint printgap noloewdin
keywords: NOSOSCF
formula: C19H25NO4
InChI: InChI=1/C19H25NO4/c1-11(2)9-14-15(19(14,3)4)18(23)24-10-20-16(21)12-7-5-6-8-13(12)17(20)22/h9,14-15H,5-8,10H2,1-4H3
49 atoms
O  1.114225 -1.742519 -0.986411
O  1.893077 -1.610721 1.113436
O  -1.601127 -1.4007 -2.757486
O  -1.322653 -1.288791 1.788307
N  -1.166888 -1.622063 -0.499429
C  4.179463 0.141739 0.00515
C  3.01066 1.067021 0.054413
C  2.885248 -0.301614 -0.633981
C  5.273529 0.494575 -0.978208
C  4.714524 -0.507673 1.25817
C  2.265952 1.36438 1.30034
C  1.955167 -1.279397 -0.03601
C  1.040526 1.888674 1.340805
C  -0.024746 -2.47723 -0.58231
C  0.35004 2.161855 2.641523
C  0.251052 2.229173 0.112066
C  -2.806339 -0.118051 -1.099696
C  -2.715368 -0.080583 0.228834
C  -3.746072 0.690661 -1.915308
C  -3.520274 0.797732 1.114132
C  -4.80592 1.314066 -1.0047
C  -4.191633 1.885067 0.273441
C  -1.814062 -1.097069 -1.616981
C  -1.667632 -1.042489 0.66809
H  3.043134 1.885734 -0.659013
H  2.854642 -0.274107 -1.717154
H  5.823181 -0.395916 -1.287876
H  4.879005 0.969877 -1.877494
H  5.986477 1.18623 -0.526081
H  5.435307 0.161287 1.732552
H  3.949195 -0.756545 1.985816
H  5.239419 -1.431198 1.009152
H  2.758847 1.141061 2.239732
H  0.121413 -2.960447 0.382619
H  -0.193746 -3.224512 -1.354139
H  1.001538 1.983187 3.495524
H  -0.007152 3.193388 2.696501
H  -0.52252 1.512671 2.753085
H  -0.784105 1.893775 0.209524
H  0.210351 3.311509 -0.038021
H  0.65568 1.781219 -0.793994
H  -3.186443 1.466037 -2.448809
H  -4.204442 0.072512 -2.690471
H  -4.266757 0.198053 1.644867
H  -2.887573 1.234454 1.890939
H  -5.345501 2.093796 -1.544181
H  -5.544566 0.552209 -0.738984
H  -4.955265 2.392322 0.864742
H  -3.44854 2.64383 0.00901
totalener: -1094.84806373 hartree
nucrepener: 2213.44315286 hartree
electener: -3308.29121659 hartree
oneelecener: -5888.86111894 hartree
twoeener: 2580.56990236 hartree
kineticenergy: 1090.10197568 hartree
xcener: -105.973165252108 hartree
chargesum: -0.0000000
charge: -0.265035 -0.350533 -0.315830 -0.291078 -0.101951 0.143498 -0.062741 -0.108535 -0.243382 -0.278704 -0.170034 0.322219 0.010219 0.069418 -0.214421 -0.247028 -0.074277 -0.100519 -0.070410 -0.084890 -0.134382 -0.133534 0.261221 0.205998 0.092181 0.087417 0.091310 0.070845 0.088888 0.088158 0.103550 0.086432 0.086045 0.134294 0.119399 0.081976 0.085106 0.082353 0.031625 0.110748 0.092908 0.091618 0.095572 0.102022 0.098691 0.079852 0.075447 0.083887 0.074387
qa: -0.2650 -0.3505 -0.3158 -0.2911 -0.1020 0.1435 -0.0627 -0.1085 -0.2434 -0.2787 -0.1700 0.3222 0.0102 0.0694 -0.2144 -0.2470 -0.0743 -0.1005 -0.0704 -0.0849 -0.1344 -0.1335 0.2612 0.2060 0.0922 0.0874 0.0913 0.0708 0.0889 0.0882 0.1035 0.0864 0.0860 0.1343 0.1194 0.0820 0.0851 0.0824 0.0316 0.1107 0.0929 0.0916 0.0956 0.1020 0.0987 0.0799 0.0754 0.0839 0.0744
va: 2.1164 2.1357 2.1984 2.2078 3.0820 3.7471 3.8786 3.8239 3.9006 3.9077 3.9126 4.1906 3.7215 3.9274 3.9377 3.9438 3.6079 3.5584 3.9208 3.9038 3.8955 3.8871 4.2711 4.2628 1.0032 1.0296 1.0052 1.0066 1.0046 0.9978 1.0220 1.0043 1.0147 1.0176 1.0000 1.0157 0.9951 1.0090 1.0088 1.0006 1.0094 1.0105 1.0183 1.0099 1.0189 1.0119 1.0086 1.0129 1.0090
dispcorr: -0.028029932 hartree
energy: -1094.876093658847
dipole: 6.24927 -7.05138 -0.80211 20.17597 -19.05419 1.12178 5.01376 -5.39856 -0.38480
magnitude: 1.43173 au
magnitude: 3.63916 debye
