program: Orca
programVersion: 5.0.2
elementType: O O O O N C C C C C C C C C C C C C C C C C C C H H H H H H H H H H H H H H H H H H H H H H H H H
charge: 0
multiplicity: 1
keywords: wb97x-d3
keywords: def2-TZVPP
keywords: def2/J RIJCOSX
keywords: DEFGRID2
keywords: scfconv7
keywords: smallprint printgap noloewdin
keywords: NOSOSCF
formula: C19H25NO4
InChI: InChI=1/C19H25NO4/c1-11(2)9-14-15(19(14,3)4)18(23)24-10-20-16(21)12-7-5-6-8-13(12)17(20)22/h9,14-15H,5-8,10H2,1-4H3
49 atoms
O  1.18236 -1.098697 -0.482394
O  2.681103 -2.142726 -1.759022
O  -1.425913 0.1488 -2.390043
O  -1.266722 -2.245855 1.472514
N  -1.086106 -1.30502 -0.62726
C  3.632461 -0.224525 1.173768
C  3.16287 0.918638 0.338174
C  3.438982 -0.429344 -0.318427
C  5.071837 -0.207232 1.634779
C  2.708914 -0.871582 2.177622
C  1.816554 1.526658 0.492893
C  2.421918 -1.311604 -0.928675
C  1.164466 2.197035 -0.456268
C  0.143092 -1.889795 -1.036594
C  -0.146307 2.868411 -0.178206
C  1.662235 2.328481 -1.861873
C  -2.810482 0.204338 -0.406644
C  -2.763769 -0.49517 0.727053
C  -3.798022 1.270128 -0.712067
C  -3.675454 -0.307664 1.883396
C  -4.940688 1.218037 0.304108
C  -4.426528 1.016618 1.729892
C  -1.718513 -0.263665 -1.301786
C  -1.642408 -1.468945 0.64003
H  3.935824 1.644335 0.09464
H  4.362006 -0.487797 -0.883935
H  5.167225 0.341875 2.573429
H  5.442938 -1.219825 1.801712
H  5.7283 0.270028 0.906164
H  1.661814 -0.863861 1.889291
H  2.995896 -1.911398 2.343293
H  2.791903 -0.355712 3.136391
H  1.364115 1.456695 1.477527
H  0.201344 -2.913385 -0.665655
H  0.192196 -1.897825 -2.124922
H  -0.519508 2.644086 0.821111
H  -0.05499 3.954334 -0.266124
H  -0.902269 2.564516 -0.905503
H  1.737509 3.378155 -2.156706
H  2.635665 1.866586 -2.014183
H  0.958941 1.858296 -2.553703
H  -3.298116 2.244007 -0.682162
H  -4.171705 1.161994 -1.732712
H  -4.376054 -1.147503 1.933137
H  -3.112625 -0.337247 2.818986
H  -5.529626 2.134342 0.243265
H  -5.616046 0.397791 0.044403
H  -5.256077 1.055478 2.437276
H  -3.756477 1.84097 1.991113
totalener: -1094.84914454 hartree
nucrepener: 2218.05530682 hartree
electener: -3312.90445136 hartree
oneelecener: -5897.72034204 hartree
twoeener: 2584.81589068 hartree
kineticenergy: 1090.10131330 hartree
xcener: -105.973637968740 hartree
chargesum: 0.0000000
charge: -0.249625 -0.363055 -0.323459 -0.316765 -0.091614 0.128926 -0.036881 -0.142006 -0.246813 -0.274568 -0.178776 0.350604 -0.008945 0.068597 -0.235870 -0.249409 -0.085886 -0.066834 -0.059085 -0.076148 -0.134657 -0.133078 0.213451 0.243311 0.097747 0.088616 0.085768 0.093453 0.071374 0.089288 0.094770 0.087468 0.087328 0.126545 0.126720 0.079499 0.105070 0.067569 0.091043 0.083937 0.102928 0.092227 0.097363 0.092804 0.094062 0.080633 0.077077 0.081074 0.074224
qa: -0.2496 -0.3631 -0.3235 -0.3168 -0.0916 0.1289 -0.0369 -0.1420 -0.2468 -0.2746 -0.1788 0.3506 -0.0089 0.0686 -0.2359 -0.2494 -0.0859 -0.0668 -0.0591 -0.0761 -0.1347 -0.1331 0.2135 0.2433 0.0977 0.0886 0.0858 0.0935 0.0714 0.0893 0.0948 0.0875 0.0873 0.1265 0.1267 0.0795 0.1051 0.0676 0.0910 0.0839 0.1029 0.0922 0.0974 0.0928 0.0941 0.0806 0.0771 0.0811 0.0742
va: 2.0879 2.1433 2.1742 2.1905 3.1085 3.7334 3.8134 3.8666 3.9127 3.9254 3.8573 4.1963 3.7333 3.9224 3.9356 3.9490 3.6069 3.6308 3.9056 3.9273 3.9015 3.8943 4.2358 4.2622 1.0067 1.0278 1.0039 1.0041 1.0087 1.0117 1.0052 0.9998 1.0066 1.0002 1.0086 1.0077 0.9995 1.0078 1.0019 1.0075 1.0055 1.0104 1.0205 1.0070 1.0194 1.0118 1.0093 1.0120 1.0112
dispcorr: -0.028279395 hartree
energy: -1094.877423933176
dipole: 2.59511 -3.84957 -1.25446 17.41221 -16.20781 1.20440 9.95709 -8.99695 0.96014
magnitude: 1.98648 au
magnitude: 5.04924 debye
