program: Orca
programVersion: 5.0.2
elementType: O O O O N C C C C C C C C C C C C C C C C C C C H H H H H H H H H H H H H H H H H H H H H H H H H
charge: 0
multiplicity: 1
keywords: wb97x-d3
keywords: def2-TZVPP
keywords: def2/J RIJCOSX
keywords: DEFGRID2
keywords: scfconv7
keywords: smallprint printgap noloewdin
keywords: NOSOSCF
formula: C19H25NO4
InChI: InChI=1/C19H25NO4/c1-11(2)9-14-15(19(14,3)4)18(23)24-10-20-16(21)12-7-5-6-8-13(12)17(20)22/h9,14-15H,5-8,10H2,1-4H3
49 atoms
O  1.054112 -1.175993 -0.497158
O  2.524868 -2.260917 -1.767075
O  -1.601384 -3.050323 0.969648
O  -1.422078 0.607946 -1.730095
N  -1.222967 -1.393241 -0.595913
C  3.301391 0.084228 1.055863
C  3.35031 0.899749 -0.203369
C  3.353484 -0.625329 -0.278368
C  4.575761 -0.006763 1.865305
C  2.066221 0.112492 1.924578
C  2.214543 1.721025 -0.676201
C  2.295306 -1.433487 -0.925472
C  2.22417 3.050028 -0.80508
C  -0.003733 -1.856622 -1.160035
C  1.015548 3.775757 -1.317414
C  3.386047 3.931914 -0.461493
C  -3.018362 -1.094051 0.814433
C  -2.968743 -0.02506 0.01977
C  -4.039334 -1.33004 1.865743
C  -3.91283 1.118909 0.067814
C  -5.199436 -0.348395 1.684248
C  -4.709048 1.066145 1.37339
C  -1.891306 -2.001606 0.467259
C  -1.805933 -0.165112 -0.896133
H  4.325531 1.316142 -0.434442
H  4.320414 -1.044328 -0.531789
H  5.464507 -0.01685 1.232938
H  4.661861 0.844504 2.543158
H  4.590809 -0.916069 2.469207
H  1.16288 0.391127 1.391677
H  1.896041 -0.854838 2.399447
H  2.212139 0.848222 2.717573
H  1.300751 1.208121 -0.948596
H  0.069765 -2.933596 -1.011101
H  0.014498 -1.639881 -2.228255
H  0.65141 4.498234 -0.58192
H  1.253065 4.345444 -2.219592
H  0.199569 3.094976 -1.556429
H  3.713832 4.502254 -1.334186
H  3.096145 4.665459 0.295137
H  4.246238 3.39065 -0.073303
H  -4.388964 -2.36431 1.830284
H  -3.576814 -1.209069 2.850696
H  -3.370781 2.062426 -0.027585
H  -4.582539 1.073687 -0.797122
H  -5.838912 -0.695039 0.867315
H  -5.820497 -0.341533 2.581072
H  -4.077176 1.419114 2.193601
H  -5.555213 1.752444 1.317569
totalener: -1094.84999354 hartree
nucrepener: 2143.09127893 hartree
electener: -3237.94127247 hartree
oneelecener: -5747.75669300 hartree
twoeener: 2509.81542053 hartree
kineticenergy: 1090.08233180 hartree
xcener: -105.969118527236 hartree
chargesum: -0.0000000
charge: -0.267600 -0.360193 -0.313955 -0.332046 -0.107632 0.158583 -0.012039 -0.124792 -0.253446 -0.235239 -0.215190 0.327673 -0.021233 0.063283 -0.214310 -0.243828 -0.091593 -0.062483 -0.073199 -0.075570 -0.136306 -0.134291 0.258469 0.244716 0.087538 0.088608 0.073601 0.084642 0.092198 0.075369 0.098871 0.079283 0.095650 0.128532 0.131092 0.076359 0.082689 0.087611 0.089488 0.084142 0.077242 0.094749 0.094337 0.093963 0.093197 0.076103 0.080646 0.076246 0.080063
qa: -0.2676 -0.3602 -0.3140 -0.3320 -0.1076 0.1586 -0.0120 -0.1248 -0.2534 -0.2352 -0.2152 0.3277 -0.0212 0.0633 -0.2143 -0.2438 -0.0916 -0.0625 -0.0732 -0.0756 -0.1363 -0.1343 0.2585 0.2447 0.0875 0.0886 0.0736 0.0846 0.0922 0.0754 0.0989 0.0793 0.0956 0.1285 0.1311 0.0764 0.0827 0.0876 0.0895 0.0841 0.0772 0.0947 0.0943 0.0940 0.0932 0.0761 0.0806 0.0762 0.0801
va: 2.0939 2.1452 2.1995 2.1676 3.1112 3.6595 3.7776 3.9241 3.9178 3.9149 3.9137 4.2255 3.7574 3.9146 3.9360 3.9438 3.6437 3.6164 3.9238 3.9261 3.8980 3.8980 4.2646 4.2419 1.0100 1.0266 1.0079 1.0044 1.0036 1.0145 1.0051 1.0046 1.0176 1.0068 0.9998 0.9975 0.9991 1.0170 0.9986 0.9998 1.0133 1.0190 1.0087 1.0193 1.0079 1.0085 1.0118 1.0089 1.0119
dispcorr: -0.024659026 hartree
energy: -1094.874652562264
dipole: 5.55951 -6.84197 -1.28245 22.38361 -21.18941 1.19420 11.43442 -10.30168 1.13274
magnitude: 2.08660 au
magnitude: 5.30371 debye
