program: Orca
programVersion: 5.0.2
elementType: O O O O N C C C C C C C C C C C C C C C C C C C H H H H H H H H H H H H H H H H H H H H H H H H H
charge: 0
multiplicity: 1
keywords: wb97x-d3
keywords: def2-TZVPP
keywords: def2/J RIJCOSX
keywords: DEFGRID2
keywords: scfconv7
keywords: smallprint printgap noloewdin
keywords: NOSOSCF
formula: C19H25NO4
InChI: InChI=1/C19H25NO4/c1-11(2)9-14-15(19(14,3)4)18(23)24-10-20-16(21)12-7-5-6-8-13(12)17(20)22/h9,14-15H,5-8,10H2,1-4H3
49 atoms
O  1.220005 -1.34417 -0.489589
O  2.768602 -2.775862 -1.205289
O  -1.234201 -2.416393 1.727114
O  -1.311786 -0.294833 -2.293998
N  -1.033911 -1.642276 -0.4400
C  3.442016 0.262279 0.764602
C  3.208437 0.850557 -0.59232
C  3.46923 -0.641062 -0.456276
C  4.793191 0.500404 1.399914
C  2.327367 0.187392 1.780673
C  1.906146 1.400164 -1.054728
C  2.47937 -1.698962 -0.755267
C  1.336487 2.509059 -0.58196
C  0.189117 -2.269209 -0.802994
C  0.037498 3.010434 -1.139421
C  1.919157 3.344498 0.516879
C  -2.640248 -0.641317 0.873157
C  -2.665289 -0.022625 -0.307348
C  -3.515995 -0.314156 2.025932
C  -3.588235 1.079602 -0.674956
C  -4.179634 1.043979 1.789627
C  -4.708972 1.177928 0.361559
C  -1.577202 -1.681284 0.844857
C  -1.616581 -0.61437 -1.17847
H  4.067407 1.371341 -1.011451
H  4.457388 -0.966976 -0.759098
H  4.79881 1.444095 1.949948
H  5.03939 -0.295028 2.105494
H  5.592972 0.546168 0.659681
H  2.386442 -0.737004 2.35731
H  2.426757 1.015756 2.484699
H  1.337446 0.251882 1.340787
H  1.413352 0.885544 -1.872053
H  0.3023 -3.193367 -0.236884
H  0.186498 -2.496758 -1.868815
H  -0.348102 2.364452 -1.926764
H  -0.721019 3.076032 -0.353415
H  0.14515 4.018095 -1.548756
H  1.247564 3.380849 1.378559
H  2.886041 2.983144 0.861133
H  2.049803 4.377238 0.183431
H  -4.26998 -1.098969 2.145239
H  -2.938223 -0.316326 2.952761
H  -3.023788 2.016486 -0.728934
H  -3.99029 0.92129 -1.678092
H  -4.990097 1.189094 2.505263
H  -3.451045 1.837295 1.980885
H  -5.237513 2.125083 0.244527
H  -5.442895 0.388989 0.173373
totalener: -1094.84870825 hartree
nucrepener: 2209.93265427 hartree
electener: -3304.78136252 hartree
oneelecener: -5881.33947580 hartree
twoeener: 2576.55811329 hartree
kineticenergy: 1090.10215569 hartree
xcener: -105.973277895881 hartree
chargesum: 0.0000000
charge: -0.257176 -0.359959 -0.313950 -0.325952 -0.109436 0.054099 -0.011014 -0.072397 -0.246301 -0.252211 -0.192199 0.310430 -0.009460 0.075319 -0.252929 -0.247890 -0.066301 -0.056151 -0.075908 -0.076616 -0.135413 -0.131242 0.236306 0.227104 0.100692 0.086941 0.079092 0.097388 0.074360 0.112181 0.080608 0.084034 0.096475 0.126500 0.127351 0.096946 0.071504 0.098453 0.089324 0.082504 0.097494 0.092854 0.094757 0.089096 0.097715 0.081055 0.074600 0.080521 0.076801
qa: -0.2572 -0.3600 -0.3140 -0.3260 -0.1094 0.0541 -0.0110 -0.0724 -0.2463 -0.2522 -0.1922 0.3104 -0.0095 0.0753 -0.2529 -0.2479 -0.0663 -0.0562 -0.0759 -0.0766 -0.1354 -0.1312 0.2363 0.2271 0.1007 0.0869 0.0791 0.0974 0.0744 0.1122 0.0806 0.0840 0.0965 0.1265 0.1274 0.0969 0.0715 0.0985 0.0893 0.0825 0.0975 0.0929 0.0948 0.0891 0.0977 0.0811 0.0746 0.0805 0.0768
va: 2.0829 2.1495 2.1946 2.1746 3.1232 3.7168 3.7981 3.8431 3.9187 3.8965 3.8795 4.2463 3.6695 3.9210 3.9401 3.9415 3.6319 3.6055 3.9226 3.9219 3.8973 3.8956 4.2639 4.2469 1.0055 1.0270 1.0063 1.0029 1.0089 1.0061 1.0013 1.0115 1.0298 1.0059 1.0011 1.0132 0.9936 1.0024 0.9981 1.0095 1.0039 1.0074 1.0193 1.0131 1.0200 1.0116 1.0101 1.0120 1.0092
dispcorr: -0.027982342 hartree
energy: -1094.876690590736
dipole: 2.28152 -3.51575 -1.23424 24.64261 -23.03949 1.60312 10.39806 -9.58677 0.81129
magnitude: 2.17980 au
magnitude: 5.54061 debye
