program: Orca
programVersion: 5.0.2
elementType: O O O O N C C C C C C C C C C C C C C C C C C C H H H H H H H H H H H H H H H H H H H H H H H H H
charge: 0
multiplicity: 1
keywords: wb97x-d3
keywords: def2-TZVPP
keywords: def2/J RIJCOSX
keywords: DEFGRID2
keywords: scfconv7
keywords: smallprint printgap noloewdin
keywords: NOSOSCF
formula: C19H25NO4
InChI: InChI=1/C19H25NO4/c1-11(2)9-14-15(19(14,3)4)18(23)24-10-20-16(21)12-7-5-6-8-13(12)17(20)22/h9,14-15H,5-8,10H2,1-4H3
49 atoms
O  1.036894 -0.942958 -0.596386
O  2.545876 -1.834064 -1.969671
O  -1.432229 -3.157207 0.466009
O  -1.579039 0.991958 -1.395686
N  -1.229946 -1.194339 -0.736147
C  3.18953 0.03863 1.232526
C  3.374735 0.980381 0.079605
C  3.326598 -0.534851 -0.157715
C  4.398374 -0.189066 2.114121
C  1.904379 0.007404 2.027275
C  2.314955 1.875614 -0.417438
C  2.290792 -1.171401 -0.999877
C  2.4891 3.046782 -1.036546
C  -0.007182 -1.455055 -1.411358
C  1.302764 3.842878 -1.49529
C  3.81241 3.679057 -1.345677
C  -2.958698 -1.30721 0.780101
C  -3.003576 -0.092737 0.232857
C  -3.916054 -1.824726 1.789028
C  -4.004858 0.953584 0.557085
C  -5.143481 -0.912913 1.840278
C  -4.755433 0.566065 1.833145
C  -1.806226 -2.049353 0.203725
C  -1.883023 0.035857 -0.737101
H  4.379864 1.373653 -0.022053
H  4.292968 -0.971646 -0.382238
H  4.329081 -1.150146 2.626749
H  5.329663 -0.185181 1.54626
H  4.471847 0.590211 2.874765
H  1.02832 0.334892 1.478767
H  1.705651 -0.998591 2.399548
H  2.010405 0.664345 2.892293
H  1.291699 1.549022 -0.279724
H  0.099572 -2.529636 -1.556477
H  -0.011387 -0.957727 -2.381639
H  1.358938 4.043889 -2.568147
H  0.36277 3.326754 -1.304449
H  1.26556 4.816159 -0.998638
H  3.869639 4.68104 -0.913917
H  4.668891 3.1160 -0.982591
H  3.933964 3.799984 -2.424821
H  -4.197412 -2.853343 1.552784
H  -3.423298 -1.870243 2.765672
H  -3.516377 1.924572 0.665513
H  -4.697667 1.063652 -0.28356
H  -5.782048 -1.123069 0.977421
H  -5.736769 -1.14075 2.726917
H  -4.121625 0.776233 2.699398
H  -5.644691 1.188418 1.941582
totalener: -1094.85002272 hartree
nucrepener: 2139.40030173 hartree
electener: -3234.25032445 hartree
oneelecener: -5740.41504489 hartree
twoeener: 2506.16472045 hartree
kineticenergy: 1090.09484011 hartree
xcener: -105.971827307519 hartree
chargesum: 0.0000000
charge: -0.266343 -0.361105 -0.312736 -0.326666 -0.110171 0.122043 0.028759 -0.101110 -0.249654 -0.234431 -0.193432 0.336331 -0.061603 0.071258 -0.198734 -0.243820 -0.086236 -0.059721 -0.073183 -0.073125 -0.136771 -0.135932 0.254083 0.231044 0.083103 0.084747 0.090585 0.072172 0.087681 0.067461 0.097594 0.083289 0.073682 0.126413 0.128671 0.079797 0.083844 0.079478 0.085155 0.077989 0.089598 0.094318 0.093718 0.094329 0.093322 0.076148 0.080934 0.076417 0.080808
qa: -0.2663 -0.3611 -0.3127 -0.3267 -0.1102 0.1220 0.0288 -0.1011 -0.2497 -0.2344 -0.1934 0.3363 -0.0616 0.0713 -0.1987 -0.2438 -0.0862 -0.0597 -0.0732 -0.0731 -0.1368 -0.1359 0.2541 0.2310 0.0831 0.0847 0.0906 0.0722 0.0877 0.0675 0.0976 0.0833 0.0737 0.1264 0.1287 0.0798 0.0838 0.0795 0.0852 0.0780 0.0896 0.0943 0.0937 0.0943 0.0933 0.0761 0.0809 0.0764 0.0808
va: 2.0905 2.1436 2.2001 2.1731 3.1126 3.6918 3.7641 3.8435 3.9176 3.9167 3.9225 4.2321 3.8321 3.9160 3.9305 3.9395 3.6373 3.6243 3.9208 3.9229 3.8969 3.8972 4.2607 4.2512 1.0094 1.0284 1.0039 1.0085 1.0035 1.0146 1.0038 1.0040 1.0179 1.0069 1.0001 0.9997 1.0183 0.9977 0.9987 1.0167 0.9991 1.0194 1.0087 1.0192 1.0081 1.0086 1.0118 1.0088 1.0118
dispcorr: -0.024338354 hartree
energy: -1094.874361071953
dipole: 6.08524 -7.34566 -1.26042 18.91252 -18.01574 0.89678 11.61667 -10.36922 1.24745
magnitude: 1.98722 au
magnitude: 5.05110 debye
