program: Orca
programVersion: 5.0.2
elementType: O O O O N C C C C C C C C C C C C C C C C C C C H H H H H H H H H H H H H H H H H H H H H H H H H
charge: 0
multiplicity: 1
keywords: wb97x-d3
keywords: def2-TZVPP
keywords: def2/J RIJCOSX
keywords: DEFGRID2
keywords: scfconv7
keywords: smallprint printgap noloewdin
keywords: NOSOSCF
formula: C19H25NO4
InChI: InChI=1/C19H25NO4/c1-11(2)9-14-15(19(14,3)4)18(23)24-10-20-16(21)12-7-5-6-8-13(12)17(20)22/h9,14-15H,5-8,10H2,1-4H3
49 atoms
O  0.368641 -0.190832 0.060201
O  2.159991 -0.778185 1.253263
O  -1.546315 -2.755075 -1.184006
O  -2.644529 0.749968 1.504582
N  -1.745526 -1.035209 0.346126
C  3.730425 0.405276 -1.189963
C  3.65783 1.477583 -0.15307
C  2.382834 0.750578 -0.584461
C  3.916298 0.848806 -2.622712
C  4.3983 -0.916799 -0.899765
C  4.241266 1.333786 1.197052
C  1.678073 -0.149124 0.348312
C  4.313625 2.294173 2.121015
C  -0.428993 -1.035891 0.879123
C  4.970973 2.034928 3.443588
C  3.754861 3.675825 1.963625
C  -3.564725 -1.433953 -1.00632
C  -3.889109 -0.412006 -0.215059
C  -4.450273 -2.030322 -2.037327
C  -5.200235 0.283709 -0.214803
C  -5.63372 -1.095603 -2.295428
C  -6.220378 -0.549298 -0.993623
C  -2.178947 -1.867834 -0.684103
C  -2.731735 -0.104458 0.668213
H  3.698323 2.486063 -0.55195
H  1.717767 1.314453 -1.228312
H  3.485658 0.123482 -3.315359
H  3.445984 1.81354 -2.818123
H  4.977622 0.945905 -2.858749
H  5.476203 -0.82392 -1.04399
H  4.223227 -1.28647 0.105984
H  4.038745 -1.678234 -1.593924
H  4.66176 0.368341 1.448686
H  -0.455961 -0.663445 1.903345
H  -0.040906 -2.054397 0.877808
H  5.344417 1.014938 3.521773
H  5.810572 2.715337 3.60802
H  4.271318 2.198372 4.267134
H  3.007834 3.873411 2.736202
H  4.536518 4.429258 2.08953
H  3.276656 3.846995 1.001778
H  -3.88937 -2.22048 -2.955109
H  -4.796849 -3.010733 -1.694674
H  -5.535217 0.461441 0.809559
H  -5.084276 1.275699 -0.663481
H  -5.301883 -0.261167 -2.920283
H  -6.402974 -1.620701 -2.863486
H  -6.553171 -1.384267 -0.36982
H  -7.106397 0.051902 -1.202933
totalener: -1094.85360003 hartree
nucrepener: 2049.37522288 hartree
electener: -3144.22882291 hartree
oneelecener: -5560.73012544 hartree
twoeener: 2416.50130253 hartree
kineticenergy: 1090.08892513 hartree
xcener: -105.970736883151 hartree
chargesum: -0.0000000
charge: -0.267290 -0.391658 -0.316760 -0.316587 -0.126281 0.103368 -0.026556 -0.042957 -0.235948 -0.281337 -0.161812 0.331162 -0.037139 0.093294 -0.212248 -0.245969 -0.087030 -0.094061 -0.073280 -0.074525 -0.135745 -0.134675 0.259847 0.265776 0.083354 0.077367 0.090963 0.070039 0.088254 0.093969 0.102847 0.088956 0.087140 0.123623 0.120837 0.079646 0.081875 0.083913 0.088670 0.085352 0.077106 0.094439 0.092056 0.094232 0.093071 0.075570 0.079994 0.075378 0.079764
qa: -0.2673 -0.3917 -0.3168 -0.3166 -0.1263 0.1034 -0.0266 -0.0430 -0.2359 -0.2813 -0.1618 0.3312 -0.0371 0.0933 -0.2122 -0.2460 -0.0870 -0.0941 -0.0733 -0.0745 -0.1357 -0.1347 0.2598 0.2658 0.0834 0.0774 0.0910 0.0700 0.0883 0.0940 0.1028 0.0890 0.0871 0.1236 0.1208 0.0796 0.0819 0.0839 0.0887 0.0854 0.0771 0.0944 0.0921 0.0942 0.0931 0.0756 0.0800 0.0754 0.0798
va: 2.1163 2.0953 2.1982 2.1983 3.1166 3.7934 3.8295 3.8563 3.8952 3.9146 3.9060 4.1631 3.7980 3.9036 3.9421 3.9488 3.6228 3.6291 3.9267 3.9274 3.8992 3.8975 4.2779 4.2751 1.0084 1.0294 1.0050 1.0079 1.0043 0.9987 1.0215 1.0030 1.0196 1.0033 1.0048 1.0124 0.9970 0.9990 0.9992 0.9984 1.0122 1.0190 1.0085 1.0189 1.0084 1.0089 1.0116 1.0089 1.0117
dispcorr: -0.021849991 hartree
energy: -1094.875450018332
dipole: 15.81167 -16.98488 -1.17321 11.69114 -11.24821 0.44293 -3.44907 2.51263 -0.93644
magnitude: 1.56510 au
magnitude: 3.97817 debye
