program: Orca
programVersion: 5.0.2
elementType: O O O O N C C C C C C C C C C C C C C C C C C C H H H H H H H H H H H H H H H H H H H H H H H H H
charge: 0
multiplicity: 1
keywords: wb97x-d3
keywords: def2-TZVPP
keywords: def2/J RIJCOSX
keywords: DEFGRID2
keywords: scfconv7
keywords: smallprint printgap noloewdin
keywords: NOSOSCF
formula: C19H25NO4
InChI: InChI=1/C19H25NO4/c1-11(2)9-14-15(19(14,3)4)18(23)24-10-20-16(21)12-7-5-6-8-13(12)17(20)22/h9,14-15H,5-8,10H2,1-4H3
49 atoms
O  0.378225 0.593605 0.422487
O  1.812196 2.14689 -0.28917
O  -2.557091 1.537584 2.047574
O  -1.800974 -0.827622 -1.766991
N  -1.881505 0.599942 0.046756
C  3.872428 0.734709 1.573519
C  3.981791 0.045701 0.257693
C  2.609672 0.223582 0.90877
C  4.298635 -0.042248 2.798204
C  4.147091 2.213748 1.690042
C  4.359841 0.756623 -0.988641
C  1.609256 1.111168 0.286118
C  3.98293 0.396516 -2.214877
C  -0.682126 1.328982 -0.171256
C  4.434572 1.158134 -3.423016
C  3.07014 -0.758648 -2.491402
C  -3.738272 -0.321698 1.045988
C  -3.512328 -1.020084 -0.066323
C  -4.860674 -0.555929 1.988175
C  -4.328503 -2.168655 -0.533029
C  -5.894676 -1.473708 1.33258
C  -5.235076 -2.644656 0.604173
C  -2.691239 0.727523 1.173798
C  -2.310886 -0.463416 -0.744737
H  4.326498 -0.984449 0.307234
H  2.181587 -0.669439 1.349362
H  5.368273 0.080763 2.977454
H  3.769501 0.307423 3.686419
H  4.103131 -1.110425 2.694728
H  3.613744 2.632379 2.545129
H  5.213728 2.373795 1.859701
H  3.855097 2.780769 0.811434
H  5.005495 1.621941 -0.881435
H  -0.5183 1.444955 -1.242823
H  -0.77451 2.314551 0.285515
H  3.57872 1.566026 -3.9663
H  5.089929 1.987838 -3.16175
H  4.970652 0.511602 -4.12231
H  2.767201 -1.290769 -1.591941
H  2.16106 -0.417759 -2.993443
H  3.543489 -1.478293 -3.164034
H  -4.472412 -1.001909 2.909644
H  -5.308928 0.394109 2.287621
H  -4.922198 -1.864506 -1.401144
H  -3.68127 -2.974556 -0.886109
H  -6.590682 -1.843587 2.086795
H  -6.488811 -0.894519 0.619759
H  -5.996541 -3.320462 0.212326
H  -4.642215 -3.225242 1.316926
totalener: -1094.85254578 hartree
nucrepener: 2081.59457180 hartree
electener: -3176.44711757 hartree
oneelecener: -5625.24672450 hartree
twoeener: 2448.79960693 hartree
kineticenergy: 1090.10078650 hartree
xcener: -105.971990117058 hartree
chargesum: 0.0000000
charge: -0.268321 -0.377296 -0.317069 -0.320129 -0.127109 0.131983 -0.061469 -0.085646 -0.242158 -0.282318 -0.174022 0.326929 -0.002916 0.094036 -0.209945 -0.251386 -0.092211 -0.085094 -0.074529 -0.074963 -0.134747 -0.135744 0.264546 0.262302 0.095868 0.080695 0.087079 0.091962 0.069810 0.087439 0.087503 0.107770 0.082260 0.121003 0.122327 0.087660 0.076714 0.082379 0.082704 0.095577 0.093091 0.093068 0.094004 0.092643 0.094544 0.080100 0.075193 0.080155 0.075726
qa: -0.2683 -0.3773 -0.3171 -0.3201 -0.1271 0.1320 -0.0615 -0.0856 -0.2422 -0.2823 -0.1740 0.3269 -0.0029 0.0940 -0.2099 -0.2514 -0.0922 -0.0851 -0.0745 -0.0750 -0.1347 -0.1357 0.2645 0.2623 0.0959 0.0807 0.0871 0.0920 0.0698 0.0874 0.0875 0.1078 0.0823 0.1210 0.1223 0.0877 0.0767 0.0824 0.0827 0.0956 0.0931 0.0931 0.0940 0.0926 0.0945 0.0801 0.0752 0.0802 0.0757
va: 2.1026 2.1035 2.1978 2.1933 3.1171 3.7368 3.9025 3.8286 3.9036 3.9103 3.8889 4.1565 3.7594 3.9088 3.9421 3.9450 3.6298 3.6268 3.9273 3.9269 3.8968 3.8985 4.2763 4.2738 1.0050 1.0299 1.0048 1.0046 1.0076 1.0047 0.9977 1.0177 1.0115 1.0016 1.0052 0.9996 1.0111 0.9983 1.0092 1.0017 1.0009 1.0087 1.0189 1.0081 1.0190 1.0117 1.0088 1.0116 1.0088
dispcorr: -0.023087348 hartree
energy: -1094.875633124382
dipole: 15.63409 -16.60957 -0.97548 -6.47007 5.26216 -1.20791 -0.88894 1.27354 0.38460
magnitude: 1.59953 au
magnitude: 4.06569 debye
