program: Orca
programVersion: 5.0.2
elementType: O O O O N C C C C C C C C C C C C C C C C C C C H H H H H H H H H H H H H H H H H H H H H H H H H
charge: 0
multiplicity: 1
keywords: wb97x-d3
keywords: def2-TZVPP
keywords: def2/J RIJCOSX
keywords: DEFGRID2
keywords: scfconv7
keywords: smallprint printgap noloewdin
keywords: NOSOSCF
formula: C19H25NO4
InChI: InChI=1/C19H25NO4/c1-11(2)9-14-15(19(14,3)4)18(23)24-10-20-16(21)12-7-5-6-8-13(12)17(20)22/h9,14-15H,5-8,10H2,1-4H3
49 atoms
O  0.409898 -1.026975 -0.096116
O  1.720012 -0.244576 -1.737099
O  -1.858304 0.927061 -1.297741
O  -2.425034 -3.219989 0.480578
N  -1.824212 -1.275153 -0.61304
C  2.469115 1.872296 0.461823
C  3.558095 0.845446 0.526252
C  2.101676 0.401273 0.548485
C  2.198279 2.676458 1.711099
C  2.234076 2.655326 -0.80571
C  4.47504 0.57081 -0.597537
C  1.436766 -0.295137 -0.570995
C  5.809038 0.582618 -0.531164
C  -0.498233 -1.60195 -1.019746
C  6.635114 0.286808 -1.747869
C  6.613671 0.881294 0.69795
C  -3.685334 -0.04697 -0.041129
C  -3.848363 -1.262056 0.481809
C  -4.659801 1.067599 0.06338
C  -5.027033 -1.698169 1.272222
C  -6.004195 0.529536 0.55757
C  -5.832948 -0.470489 1.701793
C  -2.37144 -0.000551 -0.737043
C  -2.651898 -2.087213 0.159113
H  4.012504 0.746837 1.506322
H  1.739221 0.079504 1.517714
H  2.845774 3.554596 1.749343
H  1.163951 3.024422 1.73487
H  2.373938 2.096726 2.618469
H  2.472254 2.105729 -1.710833
H  1.190256 2.966542 -0.87416
H  2.850994 3.555538 -0.793201
H  4.023107 0.346461 -1.554864
H  -0.39209 -2.685852 -1.000809
H  -0.314224 -1.232978 -2.027377
H  6.019264 0.078639 -2.621582
H  7.291592 1.126395 -1.991317
H  7.284576 -0.576759 -1.581701
H  7.266153 1.741332 0.525831
H  6.01298 1.103487 1.577167
H  7.268743 0.041996 0.945767
H  -4.26788 1.825804 0.749184
H  -4.766651 1.570517 -0.900424
H  -5.640916 -2.372732 0.666499
H  -4.708967 -2.284625 2.13689
H  -6.639065 1.357922 0.87528
H  -6.523786 0.042846 -0.272978
H  -6.809053 -0.782024 2.076585
H  -5.32211 0.019726 2.535746
totalener: -1094.85267267 hartree
nucrepener: 2063.92607384 hartree
electener: -3158.77874651 hartree
oneelecener: -5589.85536001 hartree
twoeener: 2431.07661351 hartree
kineticenergy: 1090.08927468 hartree
xcener: -105.972136020924 hartree
chargesum: -0.0000000
charge: -0.276129 -0.390131 -0.319839 -0.319246 -0.113852 0.101661 0.021235 -0.104095 -0.245247 -0.253082 -0.222515 0.372272 -0.040759 0.069686 -0.209299 -0.242610 -0.072958 -0.096304 -0.074044 -0.075842 -0.135192 -0.134267 0.252364 0.266553 0.085879 0.081513 0.088421 0.089834 0.069699 0.099626 0.096800 0.084145 0.115531 0.113620 0.138991 0.082355 0.080983 0.081928 0.085376 0.075586 0.087139 0.093045 0.094125 0.091597 0.095422 0.080038 0.075129 0.079503 0.075351
qa: -0.2761 -0.3901 -0.3198 -0.3192 -0.1139 0.1017 0.0212 -0.1041 -0.2452 -0.2531 -0.2225 0.3723 -0.0408 0.0697 -0.2093 -0.2426 -0.0730 -0.0963 -0.0740 -0.0758 -0.1352 -0.1343 0.2524 0.2666 0.0859 0.0815 0.0884 0.0898 0.0697 0.0996 0.0968 0.0841 0.1155 0.1136 0.1390 0.0824 0.0810 0.0819 0.0854 0.0756 0.0871 0.0930 0.0941 0.0916 0.0954 0.0800 0.0751 0.0795 0.0754
va: 2.1087 2.1003 2.1898 2.1949 3.0900 3.7441 3.8013 3.9147 3.9104 3.9270 3.9032 4.1306 3.7887 3.8920 3.9408 3.9466 3.6127 3.6508 3.9273 3.9235 3.8982 3.8989 4.2832 4.2815 1.0102 1.0303 1.0041 1.0049 1.0082 1.0190 1.0041 1.0020 1.0273 1.0103 1.0134 1.0125 0.9982 0.9978 0.9996 1.0159 0.9987 1.0086 1.0186 1.0082 1.0192 1.0118 1.0086 1.0117 1.0087
dispcorr: -0.022367515 hartree
energy: -1094.875040187383
dipole: 17.67322 -18.80130 -1.12808 16.19527 -15.63443 0.56084 6.86162 -5.87038 0.99124
magnitude: 1.60302 au
magnitude: 4.07454 debye
