program: Orca
programVersion: 5.0.2
elementType: O O O O N C C C C C C C C C C C C C C C C C C C H H H H H H H H H H H H H H H H H H H H H H H H H
charge: 0
multiplicity: 1
keywords: wb97x-d3
keywords: def2-TZVPP
keywords: def2/J RIJCOSX
keywords: DEFGRID2
keywords: scfconv7
keywords: smallprint printgap noloewdin
keywords: NOSOSCF
formula: C19H25NO4
InChI: InChI=1/C19H25NO4/c1-11(2)9-14-15(19(14,3)4)18(23)24-10-20-16(21)12-7-5-6-8-13(12)17(20)22/h9,14-15H,5-8,10H2,1-4H3
49 atoms
O  -0.536812 1.680467 1.322283
O  -0.579972 1.623784 -0.912667
O  2.40788 2.288983 -1.123991
O  1.600981 -0.249137 2.562504
N  1.757594 1.296846 0.861169
C  -3.649446 1.154668 -0.570324
C  -3.015803 -0.200517 -0.577916
C  -2.47814 0.881246 0.354922
C  -3.494914 2.016044 -1.799499
C  -4.97874 1.359932 0.11651
C  -3.649529 -1.389426 0.021267
C  -1.129766 1.425998 0.144978
C  -3.650629 -2.626386 -0.486058
C  0.774708 2.224794 1.324331
C  -4.316802 -3.752586 0.245613
C  -2.989741 -3.01679 -1.775873
C  3.254204 0.129791 -0.444583
C  3.00816 -0.62524 0.626721
C  4.191953 -0.219059 -1.538729
C  3.592809 -1.964006 0.880682
C  5.071292 -1.39006 -1.097249
C  4.2590 -2.478676 -0.39742
C  2.450012 1.372071 -0.343333
C  2.052882 0.098005 1.499541
H  -2.384949 -0.384152 -1.441206
H  -2.747856 0.762789 1.398107
H  -2.59999 1.792334 -2.374487
H  -4.351128 1.853307 -2.456676
H  -3.477324 3.076162 -1.54027
H  -5.797772 1.056187 -0.538057
H  -5.069489 0.801144 1.046618
H  -5.119768 2.41578 0.354173
H  -4.151094 -1.233082 0.97168
H  0.964657 2.483487 2.362804
H  0.835676 3.131523 0.723738
H  -5.123317 -4.183886 -0.352791
H  -3.610963 -4.564493 0.439865
H  -4.736166 -3.434843 1.199879
H  -2.010052 -3.466586 -1.5910
H  -3.582315 -3.77127 -2.296957
H  -2.844167 -2.183087 -2.461307
H  3.622087 -0.476922 -2.436834
H  4.800661 0.64781 -1.806351
H  4.316812 -1.897439 1.698486
H  2.817132 -2.654547 1.220227
H  5.587506 -1.805512 -1.963264
H  5.844562 -1.021687 -0.417387
H  4.8988 -3.328601 -0.158197
H  3.488224 -2.848055 -1.079575
elementType: O N C H
totalener: -1094.86916235 hartree
nucrepener: 2107.66551926 hartree
electener: -3202.53468161 hartree
oneelecener: -5678.09819555 hartree
twoeener: 2475.56351394 hartree
cpcmener: -0.04092819 hartree
kineticenergy: 1090.03811156 hartree
xcener: -105.974185777336 hartree
chargesum: -0.0000000
charge: -0.288735 -0.492162 -0.430712 -0.435555 -0.103164 0.115258 0.047996 -0.126111 -0.280543 -0.272731 -0.294171 0.441595 -0.031410 0.083974 -0.218866 -0.270235 -0.066744 -0.077311 -0.074012 -0.073709 -0.135802 -0.137575 0.338972 0.333448 0.099350 0.088545 0.091984 0.095585 0.099205 0.097654 0.090304 0.097886 0.121168 0.145667 0.134891 0.093968 0.095142 0.087645 0.105592 0.093702 0.095697 0.102872 0.093980 0.102271 0.094477 0.081546 0.078434 0.081344 0.079399
qa: -0.2887 -0.4922 -0.4307 -0.4356 -0.1032 0.1153 0.0480 -0.1261 -0.2805 -0.2727 -0.2942 0.4416 -0.0314 0.0840 -0.2189 -0.2702 -0.0667 -0.0773 -0.0740 -0.0737 -0.1358 -0.1376 0.3390 0.3334 0.0993 0.0885 0.0920 0.0956 0.0992 0.0977 0.0903 0.0979 0.1212 0.1457 0.1349 0.0940 0.0951 0.0876 0.1056 0.0937 0.0957 0.1029 0.0940 0.1023 0.0945 0.0815 0.0784 0.0813 0.0794
va: 2.1115 2.0154 2.0782 2.0748 3.0880 3.6768 3.7762 3.8543 3.8987 3.9127 3.8987 4.1165 3.7319 3.8890 3.9221 3.9407 3.6625 3.7035 3.9167 3.9179 3.9149 3.9157 4.1881 4.1900 1.0257 1.0383 1.0207 0.9997 0.9998 1.0016 1.0062 1.0014 1.0103 0.9941 1.0146 0.9959 0.9946 1.0092 0.9940 0.9990 1.0049 1.0047 1.0157 1.0049 1.0147 1.0092 1.0066 1.0093 1.0065
dispcorr: -0.022617796 hartree
energy: -1094.891780145714
dipole: -18.67910 18.97160 0.29250 -17.97244 16.55551 -1.41693 -9.63460 9.74450 0.10990
magnitude: 1.45098 au
magnitude: 3.68809 debye
