program: Gaussian 09
title: 000067214
version: EM64L-G09RevD.01
frameworkgroup: C1[X(C30H14O2)]
method: RPBEPBE
basis: SDD
operation: Freq
keyword: #pfreq=noraman
keyword: PBEPBE/SDD
title: #p freq=noraman PBEPBE/SDD
converged: YES YES NO NO
title: Mulliken charges:
elementType: O O C C C C C C C C C C C C C C C C C C C C C C C C C C C C C C H H H H H H H H H H H H H H
charge: -0.180338 -0.180342 -0.178910 -0.178919 0.251977 0.252008 -0.328041 -0.328057 0.446419 0.446403 0.340806 0.340812 0.380074 0.380059 0.266378 0.266350 -0.394158 -0.394137 -0.384208 -0.384183 -0.436793 -0.436791 -0.253444 -0.253454 -0.369350 -0.369371 -0.419630 -0.419627 -0.247979 -0.247974 -0.238951 -0.238949 0.227574 0.227567 0.285025 0.285024 0.233217 0.233217 0.224714 0.224726 0.298375 0.298377 0.235542 0.235542 0.241711 0.241711
chargesum: 0.00000
title: Mulliken charges with hydrogens summed into heavy atoms:
elementType: O O C C C C C C C C C C C C C C C C C C C C C C C C C C C C C C
charge: -0.180338 -0.180342 -0.178910 -0.178919 0.251977 0.252008 -0.328041 -0.328057 0.446419 0.446403 0.340806 0.340812 0.380074 0.380059 0.266378 0.266350 -0.166584 -0.166570 -0.384208 -0.384183 -0.151768 -0.151767 -0.020227 -0.020237 -0.144636 -0.144644 -0.121255 -0.121250 -0.012438 -0.012432 0.002760 0.002762
polarizability: 7.37801272e+02 -1.14783831e+01 4.55551064e+02 3.44569136e-02 -1.15085425e-02 1.18592801e+02
1716.lowfreq: -6.8531 -0.0007 -0.0004 0.0004 3.5992 4.8762 21.0612 36.6863 45.9334
frequency: 21.0418 36.6850 45.9316 85.6277 95.6198 113.7916 120.7804 141.7552 158.5410 170.2171 193.1050 237.8963 239.6832 256.0563 257.3289 313.8217 325.4702 330.6883 359.5859 364.4287 373.0129 407.2013 415.7307 423.0995 426.3420 438.3247 447.1435 484.7186 501.8845 513.3372 521.3113 549.1130 577.3565 606.2423 611.3625 616.9789 635.4688 644.8680 646.7602 668.2302 671.6928 698.3580 705.5271 714.7963 746.5011 757.2507 759.1063 762.4383 791.3902 792.6526 798.5338 804.4253 830.0046 866.3427 872.1912 874.2639 885.2123 917.1422 920.0847 921.2387 925.1697 949.5300 952.5928 954.3825 979.3069 980.7895 994.8501 995.2151 1003.4528 1012.9992 1013.0549 1038.3084 1039.9943 1049.3837 1060.9439 1091.2304 1094.7422 1131.9864 1150.8899 1165.6959 1168.6612 1177.2063 1179.5164 1182.0517 1205.8114 1206.9396 1231.0122 1242.3113 1251.3872 1274.8251 1294.4369 1295.3546 1327.4615 1352.5467 1377.2494 1379.0449 1397.9047 1409.1595 1434.2179 1434.8255 1444.1692 1455.2392 1455.9941 1459.9900 1464.4013 1482.6751 1533.5474 1535.1011 1551.1196 1560.2792 1561.8630 1587.7290 1598.1840 1600.5832 1613.9113 1616.7448 1619.7495 1624.5012 3136.7158 3136.7233 3142.5088 3142.5597 3151.7965 3151.8280 3165.3891 3165.6916 3166.5375 3166.9878 3175.7418 3175.8362 3205.3355 3205.3965
redmass: 5.6075 7.3542 5.8288 5.4325 4.8386 5.4716 4.4394 7.0040 6.0145 5.5049 4.5486 5.0623 5.0045 6.8187 5.2997 5.8128 7.5717 10.0321 5.0589 5.5731 6.9854 6.5609 3.8237 3.5681 7.7935 7.6763 5.4438 4.0819 3.5851 3.7143 9.8081 5.2902 6.9771 3.9243 7.2588 7.7946 7.0730 5.0427 4.9653 7.7427 6.6586 6.9549 2.4054 2.2988 3.4258 1.8974 2.7498 3.4415 2.0181 1.9259 7.1309 2.1988 2.5408 1.8083 1.9135 3.9505 6.7313 1.7246 1.6754 6.8142 5.3985 2.7715 3.4299 4.3849 1.4397 1.4648 1.4035 1.4137 5.8276 1.4321 1.4332 2.0527 2.1193 2.5345 1.9111 2.8958 2.3262 2.8386 2.2933 1.8492 1.3741 1.4021 1.2278 1.1978 1.6870 3.2762 2.6873 2.9647 1.9145 1.7011 2.9124 3.1629 2.6791 3.1374 8.3250 8.8142 3.8645 3.2426 2.9530 6.1002 2.7981 2.9269 2.7153 2.8036 3.0473 5.1830 9.6699 9.9488 9.1509 6.3763 6.5725 9.7481 6.4928 7.6838 6.8327 7.2851 8.5903 9.4474 1.0866 1.0866 1.0870 1.0870 1.0913 1.0913 1.0935 1.0921 1.0984 1.0971 1.0972 1.0972 1.0912 1.0912
irintensity: 1.0376 1.4389 0.0704 8.9401 0.1175 0.6189 0.0302 0.0204 0.4141 0.3097 0.0871 0.0080 0.0167 0.0076 1.2162 0.1008 13.4107 0.0319 0.6163 1.7471 6.7897 0.2677 0.0247 1.9013 2.8602 0.0633 1.9254 0.1342 0.3099 0.3871 16.8945 13.7060 0.0137 0.1414 6.4318 0.0932 4.4847 1.6587 3.4187 0.1451 0.6425 2.9959 0.7940 104.9597 0.2505 3.4114 0.9087 2.3499 0.7721 69.9720 0.9640 110.3061 0.5415 0.6441 0.6832 0.1019 35.8467 0.0301 0.8956 0.0716 5.9848 0.3268 2.1242 0.6055 2.8578 0.0732 0.0003 2.9990 11.1873 5.7333 0.0340 0.0670 8.1686 0.0438 16.1062 4.0700 0.0000 0.0225 14.6149 0.0955 20.3167 0.0309 5.1527 0.0717 14.1480 0.0333 0.0135 104.5185 14.9237 0.0109 287.7830 0.7421 41.2891 0.4340 58.8399 0.0073 0.1127 53.6771 0.0004 7.5599 35.9906 0.0332 66.9077 0.0031 30.4522 0.0507 513.5111 0.6819 0.0023 74.3336 0.1682 49.6468 0.0334 7.8551 1.0301 0.0120 156.8072 0.0143 4.0239 0.0714 0.1110 20.2082 14.0147 0.0610 0.0192 6.6715 65.9759 0.1133 0.2060 30.5604 20.5343 0.5912
temp: 298.150 k
press: 1.00000 atm
elementType: 8 8 6 6 6 6 6 6 6 6 6 6 6 6 6 6 6 6 6 6 6 6 6 6 6 6 6 6 6 6 6 6 1 1 1 1 1 1 1 1 1 1 1 1 1 1
symmnumber: 1
zpe: 890781.1 jmol-1
zpe.correction: 0.339281 hartree
zpe.thermalcorrener: 0.360818 hartree
zpe.thermalcorrenthalpy: 0.361762 hartree
zpe.thermalcorrgfe: 0.288870 hartree
zpe.sumelectzpe: -1300.035989 hartree
zpe.sumelectthermal: -1300.014452 hartree
zpe.sumelectthermalent: -1300.013508 hartree
zpe.sumelectthermalfe: -1300.086400 hartree
dipole: -0.0001 0.0000 0.4174
dipole: 0.4174
quadrupole: -196.2383 -152.4754 -189.2518
quadrupole: 35.5479 0.0009 -0.0005
quadrupole: -16.9165 26.8464 -9.9299 35.5479 0.0009 -0.0005
hfenergy: -1300.3752696 hartree
pointgroup: C01 [X(C30H14O2)]
dipole: 0.0000233 -0.0000104 -0.1642314 debye
polarizability: 737.3639801|15.9683342|455.9883554|0.0342692|0.012056|118.5928008 unknown
InChI: InChI=1S/C30H14O2/c31-29-17-9-3-1-7-15(17)25-23-19(11-5-13-21(23)29)28-26-16-8-2-4-10-18(16)30(32)22-14-6-12-20(24(22)26)27(25)28/h1-14H
charge 0 multiplicity 1
46 atoms
O  -5.342986 -2.078508 0.11742
O  5.342974 2.078464 0.117931
C  -0.433353 0.608081 -0.006446
C  0.433364 -0.608174 -0.006375
C  -1.78225 0.215836 -0.03281
C  1.782264 -0.215924 -0.032525
C  -1.785321 -1.257397 0.013725
C  1.785322 1.257307 0.01409
C  -0.451914 -1.786878 0.031424
C  0.451912 1.786785 0.031514
C  -3.072234 0.893456 -0.095529
C  3.072264 -0.893525 -0.095159
C  -2.929525 -2.065445 0.064991
C  2.929512 2.065358 0.065604
C  -4.273679 0.095182 -0.040191
C  4.273693 -0.095245 -0.039575
C  -0.299196 -3.183418 0.114179
C  0.29917 3.183325 0.114224
C  -4.260212 -1.407415 0.055537
C  4.260198 1.40732 0.056631
C  -2.757337 -3.478937 0.138427
C  2.757306 3.478853 0.138949
C  -1.458465 -4.016939 0.164709
C  1.458426 4.016851 0.164956
C  -3.209165 2.304181 -0.232671
C  3.20923 -2.304223 -0.232546
C  -5.540766 0.726982 -0.090634
C  5.540795 -0.727014 -0.090042
C  -4.474306 2.914031 -0.287681
C  4.474385 -2.914043 -0.287571
C  -5.649858 2.124574 -0.207818
C  5.649918 -2.124583 -0.207475
H  0.682532 -3.660653 0.161442
H  -0.682572 3.660554 0.161286
H  -3.644798 -4.117455 0.181247
H  3.644755 4.117372 0.181979
H  -1.324477 -5.10182 0.230568
H  1.324422 5.101733 0.230778
H  -2.31422 2.920814 -0.319136
H  2.314303 -2.920854 -0.319211
H  -6.427462 0.086878 -0.041065
H  6.427477 -0.086909 -0.040248
H  -4.550725 4.001267 -0.396689
H  4.550829 -4.001258 -0.396777
H  -6.635399 2.60014 -0.246589
H  6.635469 -2.600127 -0.246249
