program: Orca
programVersion: 5.0.2
elementType: O O O O N C C C C C C C C C C C C C C C C C C C H H H H H H H H H H H H H H H H H H H H H H H H H
charge: 0
multiplicity: 1
keywords: wb97x-d3
keywords: def2-TZVPP
keywords: def2/J RIJCOSX
keywords: DEFGRID2
keywords: scfconv7
keywords: smallprint printgap noloewdin
keywords: NOSOSCF
formula: C19H25NO4
InChI: InChI=1/C19H25NO4/c1-11(2)9-14-15(19(14,3)4)18(23)24-10-20-16(21)12-7-5-6-8-13(12)17(20)22/h9,14-15H,5-8,10H2,1-4H3
49 atoms
O  -0.503774 1.854559 1.135935
O  -0.632784 1.522569 -1.073572
O  1.668375 0.101952 2.513253
O  2.357806 2.191186 -1.466416
N  1.776205 1.441529 0.642154
C  -3.671807 1.029654 -0.530683
C  -2.99144 -0.299221 -0.444216
C  -2.448216 0.879258 0.355567
C  -3.60343 1.785059 -1.835583
C  -4.974919 1.250676 0.200158
C  -3.554432 -1.442532 0.299098
C  -1.131332 1.438125 0.02423
C  -3.597335 -2.715839 -0.106753
C  0.797059 2.413005 1.016428
C  -4.185938 -3.777763 0.773081
C  -3.084556 -3.213849 -1.423087
C  3.025285 -0.494952 0.596794
C  3.225804 0.122537 -0.568133
C  3.631289 -1.789402 0.991218
C  4.11315 -0.363891 -1.651997
C  4.220182 -2.469943 -0.245735
C  5.001724 -1.48938 -1.118375
C  2.093324 0.326088 1.406613
C  2.42523 1.370779 -0.586414
H  -2.398494 -0.547083 -1.318229
H  -2.663883 0.851984 1.417656
H  -4.49535 1.561126 -2.424008
H  -3.585896 2.863507 -1.667431
H  -2.741259 1.52308 -2.443729
H  -4.995782 0.787495 1.185521
H  -5.154992 2.3185 0.335819
H  -5.807933 0.845868 -0.378248
H  -3.963649 -1.214042 1.279006
H  1.019962 2.80993 2.003189
H  0.821309 3.231214 0.297684
H  -4.526411 -3.379433 1.729069
H  -5.035664 -4.264737 0.287354
H  -3.455036 -4.565082 0.976489
H  -2.276621 -3.935105 -1.2725
H  -3.873242 -3.745205 -1.961776
H  -2.711634 -2.428942 -2.078109
H  4.406665 -1.613038 1.743201
H  2.884945 -2.427345 1.470004
H  3.500505 -0.715503 -2.488133
H  4.716309 0.4572 -2.046192
H  4.865224 -3.293106 0.063301
H  3.408819 -2.909058 -0.833038
H  5.462116 -2.016897 -1.954477
H  5.817485 -1.056987 -0.532506
elementType: O N C H
totalener: -1094.86964974 hartree
nucrepener: 2109.14961391 hartree
electener: -3204.01926365 hartree
oneelecener: -5681.06196279 hartree
twoeener: 2477.04269914 hartree
cpcmener: -0.04085877 hartree
kineticenergy: 1090.03775563 hartree
xcener: -105.974181182826 hartree
chargesum: -0.0000000
charge: -0.288178 -0.492158 -0.435604 -0.430479 -0.104716 0.111445 0.043954 -0.118467 -0.279861 -0.270298 -0.284019 0.437015 -0.049399 0.086599 -0.217297 -0.253220 -0.077900 -0.066556 -0.073916 -0.074218 -0.135328 -0.136486 0.334093 0.338687 0.100365 0.088530 0.095839 0.100062 0.091782 0.089796 0.097706 0.097720 0.121953 0.146483 0.133837 0.088733 0.093764 0.093475 0.098322 0.095377 0.089785 0.101920 0.093904 0.102734 0.094749 0.080917 0.079023 0.080981 0.078548
qa: -0.2882 -0.4922 -0.4356 -0.4305 -0.1047 0.1114 0.0440 -0.1185 -0.2799 -0.2703 -0.2840 0.4370 -0.0494 0.0866 -0.2173 -0.2532 -0.0779 -0.0666 -0.0739 -0.0742 -0.1353 -0.1365 0.3341 0.3387 0.1004 0.0885 0.0958 0.1001 0.0918 0.0898 0.0977 0.0977 0.1220 0.1465 0.1338 0.0887 0.0938 0.0935 0.0983 0.0954 0.0898 0.1019 0.0939 0.1027 0.0947 0.0809 0.0790 0.0810 0.0785
va: 2.1122 2.0153 2.0744 2.0787 3.0887 3.6786 3.7746 3.8465 3.8992 3.9131 3.8747 4.1197 3.7589 3.8867 3.9188 3.9411 3.7025 3.6665 3.9187 3.9172 3.9152 3.9173 4.1893 4.1871 1.0265 1.0384 0.9997 0.9994 1.0201 1.0059 1.0017 1.0016 1.0103 0.9936 1.0156 1.0087 0.9964 0.9961 0.9963 0.9973 1.0104 1.0045 1.0154 1.0046 1.0155 1.0093 1.0067 1.0091 1.0064
dispcorr: -0.022645545 hartree
energy: -1094.892295281846
dipole: -18.98993 19.27371 0.28378 -19.51564 18.09944 -1.41621 -6.91223 7.16556 0.25333
magnitude: 1.46641 au
magnitude: 3.72731 debye
