program: Orca
programVersion: 5.0.2
elementType: O O O O N C C C C C C C C C C C C C C C C C C C H H H H H H H H H H H H H H H H H H H H H H H H H
charge: 0
multiplicity: 1
keywords: wb97x-d3
keywords: def2-TZVPP
keywords: def2/J RIJCOSX
keywords: DEFGRID2
keywords: scfconv7
keywords: smallprint printgap noloewdin
keywords: NOSOSCF
formula: C19H25NO4
InChI: InChI=1/C19H25NO4/c1-11(2)9-14-15(19(14,3)4)18(23)24-10-20-16(21)12-7-5-6-8-13(12)17(20)22/h9,14-15H,5-8,10H2,1-4H3
49 atoms
O  -0.475647 1.630354 1.255017
O  -0.604339 1.405579 -0.966513
O  2.356718 2.150557 -1.347549
O  1.797464 -0.088103 2.571175
N  1.816384 1.303453 0.735554
C  -3.664993 1.093604 -0.390203
C  -3.072579 -0.272815 -0.539343
C  -2.433687 0.716825 0.420576
C  -3.563212 2.050952 -1.551793
C  -4.938066 1.271461 0.401501
C  -3.723188 -1.478241 0.0117
C  -1.105319 1.273088 0.125312
C  -3.985904 -2.611434 -0.647538
C  0.810735 2.226255 1.157135
C  -4.67159 -3.75435 0.03935
C  -3.655833 -2.861687 -2.086932
C  3.34497 0.110408 -0.508132
C  3.183907 -0.549079 0.639521
C  4.260874 -0.291896 -1.602671
C  3.872686 -1.810875 1.003034
C  5.223637 -1.366177 -1.093111
C  4.508101 -2.41926 -0.24818
C  2.470763 1.309131 -0.492493
C  2.203719 0.189729 1.470103
H  -2.518459 -0.412067 -1.461612
H  -2.622631 0.542717 1.473914
H  -2.725176 1.840587 -2.211546
H  -4.472614 1.984073 -2.15227
H  -3.475178 3.082951 -1.205915
H  -5.805023 1.030401 -0.216845
H  -4.979804 0.644956 1.291408
H  -5.041597 2.308923 0.724401
H  -4.021634 -1.421756 1.054589
H  1.027536 2.58257 2.160818
H  0.808058 3.078363 0.478468
H  -5.608134 -4.007183 -0.464254
H  -4.054516 -4.656028 0.011394
H  -4.89904 -3.533315 1.081903
H  -3.042181 -3.760001 -2.18961
H  -4.568528 -3.048368 -2.658679
H  -3.128411 -2.041209 -2.569096
H  3.671912 -0.666563 -2.4457
H  4.807242 0.575688 -1.979535
H  4.632996 -1.601782 1.762177
H  3.169198 -2.508506 1.46347
H  5.721836 -1.839867 -1.939607
H  6.005596 -0.893243 -0.49277
H  5.206825 -3.204364 0.042482
H  3.729723 -2.897171 -0.849557
elementType: O N C H
totalener: -1094.87006289 hartree
nucrepener: 2094.36305317 hartree
electener: -3189.23311606 hartree
oneelecener: -5651.52924067 hartree
twoeener: 2462.29612461 hartree
cpcmener: -0.04086075 hartree
kineticenergy: 1090.03817191 hartree
xcener: -105.974473461659 hartree
chargesum: 0.0000000
charge: -0.288046 -0.492320 -0.430605 -0.435824 -0.102079 0.112724 0.044475 -0.128709 -0.280280 -0.269003 -0.285110 0.443150 -0.047476 0.083400 -0.218971 -0.251925 -0.066719 -0.082279 -0.073443 -0.074113 -0.136129 -0.134521 0.340254 0.337524 0.096570 0.089027 0.092454 0.095896 0.100521 0.097743 0.089585 0.098657 0.123096 0.147204 0.134703 0.093908 0.093891 0.088842 0.095882 0.097149 0.089891 0.102788 0.094171 0.101824 0.093650 0.080915 0.078304 0.080697 0.078659
qa: -0.2880 -0.4923 -0.4306 -0.4358 -0.1021 0.1127 0.0445 -0.1287 -0.2803 -0.2690 -0.2851 0.4432 -0.0475 0.0834 -0.2190 -0.2519 -0.0667 -0.0823 -0.0734 -0.0741 -0.1361 -0.1345 0.3403 0.3375 0.0966 0.0890 0.0925 0.0959 0.1005 0.0977 0.0896 0.0987 0.1231 0.1472 0.1347 0.0939 0.0939 0.0888 0.0959 0.0971 0.0899 0.1028 0.0942 0.1018 0.0937 0.0809 0.0783 0.0807 0.0787
va: 2.1133 2.0148 2.0784 2.0746 3.0878 3.6771 3.7669 3.8628 3.9026 3.9118 3.8692 4.1192 3.7547 3.8853 3.9194 3.9415 3.6646 3.7053 3.9174 3.9199 3.9167 3.9153 4.1872 4.1891 1.0293 1.0382 1.0194 1.0001 0.9991 1.0019 1.0058 1.0017 1.0091 0.9942 1.0153 0.9959 0.9963 1.0087 0.9971 0.9970 1.0100 1.0045 1.0156 1.0044 1.0154 1.0091 1.0066 1.0093 1.0067
dispcorr: -0.022532123 hartree
energy: -1094.892595010172
dipole: -20.25788 20.54261 0.28473 -17.19687 15.95107 -1.24579 -8.89012 9.06616 0.17605
magnitude: 1.28999 au
magnitude: 3.27888 debye
