program: Orca
programVersion: 5.0.2
elementType: O O O O N C C C C C C C C C C C C C C C C C C C H H H H H H H H H H H H H H H H H H H H H H H H H
charge: 0
multiplicity: 1
keywords: wb97x-d3
keywords: def2-TZVPP
keywords: def2/J RIJCOSX
keywords: DEFGRID2
keywords: scfconv7
keywords: smallprint printgap noloewdin
keywords: NOSOSCF
formula: C19H25NO4
InChI: InChI=1/C19H25NO4/c1-11(2)9-14-15(19(14,3)4)18(23)24-10-20-16(21)12-7-5-6-8-13(12)17(20)22/h9,14-15H,5-8,10H2,1-4H3
49 atoms
O  -0.60668 1.321825 1.494453
O  -0.212425 -0.865519 1.225627
O  2.75894 -0.535043 2.091928
O  1.100685 2.791075 -0.525774
N  1.721701 1.272218 1.093408
C  -2.302202 -0.029124 -1.123066
C  -2.772304 -1.148949 -0.251935
C  -2.238407 0.104302 0.392853
C  -1.029834 -0.206346 -1.915537
C  -3.315844 0.853176 -1.807942
C  -4.209219 -1.506656 -0.119682
C  -0.932653 0.092549 1.071982
C  -4.757401 -2.048289 0.970768
C  0.685838 1.534173 2.0461
C  -6.209812 -2.410884 1.020085
C  -3.985277 -2.335246 2.221275
C  3.248328 0.10941 -0.185613
C  2.765887 1.086017 -0.955067
C  4.27904 -0.872757 -0.598636
C  3.15624 1.334153 -2.363976
C  4.940411 -0.403074 -1.895642
C  3.915555 0.11888 -2.901114
C  2.584118 0.179256 1.137661
C  1.768628 1.851628 -0.169683
H  -2.08592 -1.991189 -0.203727
H  -2.960282 0.794069 0.817314
H  -0.537538 0.753631 -2.085696
H  -0.314308 -0.872583 -1.435236
H  -1.260986 -0.632317 -2.893672
H  -4.212912 1.002726 -1.207444
H  -2.888351 1.836267 -2.01282
H  -3.620535 0.420607 -2.763017
H  -4.841249 -1.336475 -0.986762
H  0.856435 0.91685 2.927315
H  0.692935 2.578866 2.344182
H  -6.725135 -2.174845 0.089244
H  -6.340696 -3.477636 1.218429
H  -6.717055 -1.882529 1.831449
H  -4.055257 -3.39437 2.481791
H  -2.929834 -2.079732 2.145439
H  -4.403999 -1.784022 3.067371
H  5.019738 -1.003078 0.193569
H  3.807577 -1.851138 -0.735672
H  2.270977 1.540662 -2.970166
H  3.775964 2.234651 -2.416454
H  5.658392 0.388999 -1.666177
H  5.508898 -1.224713 -2.332628
H  3.20064 -0.675194 -3.134092
H  4.408919 0.381397 -3.837431
elementType: O N C H
totalener: -1094.86710373 hartree
nucrepener: 2160.71554600 hartree
electener: -3255.58264974 hartree
oneelecener: -5784.03057191 hartree
twoeener: 2528.44792217 hartree
cpcmener: -0.03823292 hartree
kineticenergy: 1090.04417848 hartree
xcener: -105.974305563035 hartree
chargesum: 0.0000000
charge: -0.280753 -0.479950 -0.427577 -0.432237 -0.104514 0.176468 -0.025003 -0.130533 -0.282341 -0.294540 -0.296519 0.416314 -0.019530 0.086226 -0.229945 -0.239453 -0.021403 -0.099803 -0.067413 -0.080869 -0.137763 -0.132294 0.310244 0.323677 0.104096 0.101515 0.091749 0.091475 0.106432 0.094326 0.099158 0.100320 0.126535 0.135859 0.144648 0.090247 0.096123 0.094806 0.100559 0.076142 0.098060 0.094395 0.102446 0.094485 0.105302 0.078420 0.081243 0.079610 0.081558
qa: -0.2808 -0.4799 -0.4276 -0.4322 -0.1045 0.1765 -0.0250 -0.1305 -0.2823 -0.2945 -0.2965 0.4163 -0.0195 0.0862 -0.2299 -0.2395 -0.0214 -0.0998 -0.0674 -0.0809 -0.1378 -0.1323 0.3102 0.3237 0.1041 0.1015 0.0917 0.0915 0.1064 0.0943 0.0992 0.1003 0.1265 0.1359 0.1446 0.0902 0.0961 0.0948 0.1006 0.0761 0.0981 0.0944 0.1024 0.0945 0.1053 0.0784 0.0812 0.0796 0.0816
va: 2.1154 2.0141 2.0808 2.0688 3.0818 3.7060 3.8385 3.8119 3.8872 3.9022 3.8844 4.1465 3.7117 3.8911 3.9290 3.9328 3.6177 3.7091 3.9052 3.9183 3.9193 3.9117 4.1960 4.1616 1.0240 1.0286 1.0083 1.0113 1.0022 1.0009 1.0031 0.9989 1.0016 1.0137 0.9927 1.0061 0.9959 0.9963 0.9996 1.0222 0.9986 1.0151 1.0052 1.0136 1.0049 1.0063 1.0092 1.0073 1.0094
dispcorr: -0.025909342 hartree
energy: -1094.893013074507
dipole: -17.55175 17.75527 0.20352 -11.13849 11.36106 0.22256 -13.01393 11.66846 -1.34547
magnitude: 1.37886 au
magnitude: 3.50477 debye
