program: Orca
programVersion: 5.0.2
elementType: O O O O N C C C C C C C C C C C C C C C C C C C H H H H H H H H H H H H H H H H H H H H H H H H H
charge: 0
multiplicity: 1
keywords: wb97x-d3
keywords: def2-TZVPP
keywords: def2/J RIJCOSX
keywords: DEFGRID2
keywords: scfconv7
keywords: smallprint printgap noloewdin
keywords: NOSOSCF
formula: C19H25NO4
InChI: InChI=1/C19H25NO4/c1-11(2)9-14-15(19(14,3)4)18(23)24-10-20-16(21)12-7-5-6-8-13(12)17(20)22/h9,14-15H,5-8,10H2,1-4H3
49 atoms
O  -0.556266 1.162619 0.85658
O  -1.815421 2.695349 1.870023
O  1.894937 2.12286 -1.219817
O  1.997772 -0.510446 2.478888
N  1.736212 1.085459 0.833703
C  -3.009362 0.982753 -1.035391
C  -2.85862 -0.248543 -0.192166
C  -2.883408 1.113662 0.475028
C  -1.868597 1.377457 -1.942321
C  -4.357757 1.342987 -1.611991
C  -3.979767 -1.177966 0.048705
C  -1.723309 1.735589 1.134587
C  -3.931397 -2.51426 0.024129
C  0.623043 1.79285 1.35823
C  -5.167521 -3.327301 0.267899
C  -2.703113 -3.327645 -0.2498
C  3.279702 0.222539 -0.643034
C  3.295955 -0.562903 0.435541
C  4.149338 0.05939 -1.832927
C  4.167832 -1.749482 0.611501
C  5.280337 -0.917359 -1.505096
C  4.772659 -2.137585 -0.738969
C  2.249043 1.26847 -0.446546
C  2.294525 -0.054893 1.403207
H  -1.87831 -0.706619 -0.255225
H  -3.80976 1.378933 0.972827
H  -0.906032 0.979612 -1.629575
H  -2.06057 0.997647 -2.947553
H  -1.781578 2.463322 -2.015952
H  -5.181234 1.156473 -0.924448
H  -4.384441 2.402025 -1.874735
H  -4.547558 0.772957 -2.523651
H  -4.940865 -0.717868 0.259657
H  0.649957 1.75384 2.446252
H  0.669943 2.832696 1.037582
H  -5.378437 -3.979915 -0.583524
H  -5.043266 -3.982609 1.133941
H  -6.045312 -2.704356 0.439081
H  -1.794237 -2.738375 -0.355251
H  -2.538587 -4.052148 0.551909
H  -2.827964 -3.909156 -1.167138
H  3.549006 -0.308333 -2.671101
H  4.546776 1.026872 -2.148003
H  4.954746 -1.514772 1.335231
H  3.600414 -2.578745 1.039915
H  5.771824 -1.229057 -2.427278
H  6.035866 -0.402826 -0.904924
H  5.583897 -2.849726 -0.585146
H  4.014017 -2.649549 -1.337656
elementType: O N C H
totalener: -1094.86951899 hartree
nucrepener: 2099.28668005 hartree
electener: -3194.15619904 hartree
oneelecener: -5660.14629040 hartree
twoeener: 2465.99009135 hartree
cpcmener: -0.03901849 hartree
kineticenergy: 1090.03392370 hartree
xcener: -105.972445526119 hartree
chargesum: 0.0000000
charge: -0.270464 -0.497216 -0.436433 -0.432136 -0.108351 0.103587 0.065295 -0.103592 -0.274167 -0.276543 -0.298570 0.428168 -0.049998 0.072842 -0.220349 -0.252915 -0.047581 -0.069905 -0.072703 -0.071680 -0.134549 -0.134450 0.318813 0.336278 0.104286 0.091327 0.079341 0.098027 0.104206 0.090414 0.098435 0.096950 0.121228 0.134176 0.136528 0.093238 0.094065 0.088895 0.089266 0.095016 0.097969 0.103192 0.094929 0.101204 0.094219 0.081749 0.078315 0.081038 0.078610
qa: -0.2705 -0.4972 -0.4364 -0.4321 -0.1084 0.1036 0.0653 -0.1036 -0.2742 -0.2765 -0.2986 0.4282 -0.0500 0.0728 -0.2203 -0.2529 -0.0476 -0.0699 -0.0727 -0.0717 -0.1345 -0.1344 0.3188 0.3363 0.1043 0.0913 0.0793 0.0980 0.1042 0.0904 0.0984 0.0970 0.1212 0.1342 0.1365 0.0932 0.0941 0.0889 0.0893 0.0950 0.0980 0.1032 0.0949 0.1012 0.0942 0.0817 0.0783 0.0810 0.0786
va: 2.1085 1.9989 2.0658 2.0785 3.1441 3.6730 3.7430 3.8589 3.9166 3.9166 3.8558 4.1243 3.7661 3.8954 3.9211 3.9408 3.6962 3.7026 3.9200 3.9165 3.9167 3.9162 4.1690 4.1787 1.0147 1.0329 1.0121 1.0017 0.9991 1.0067 1.0009 1.0013 1.0110 1.0035 1.0023 0.9957 0.9965 1.0088 1.0113 0.9968 0.9966 1.0050 1.0146 1.0046 1.0151 1.0093 1.0069 1.0093 1.0068
dispcorr: -0.023060301 hartree
energy: -1094.892579292083
dipole: -13.30939 14.76688 1.45748 -18.06926 16.10221 -1.96704 -14.62286 12.93454 -1.68832
magnitude: 2.97388 au
magnitude: 7.55900 debye
