program: Orca
programVersion: 5.0.2
elementType: O O O O N C C C C C C C C C C C C C C C C C C C H H H H H H H H H H H H H H H H H H H H H H H H H
charge: 0
multiplicity: 1
keywords: wb97x-d3
keywords: def2-TZVPP
keywords: def2/J RIJCOSX
keywords: DEFGRID2
keywords: scfconv7
keywords: smallprint printgap noloewdin
keywords: NOSOSCF
formula: C19H25NO4
InChI: InChI=1/C19H25NO4/c1-11(2)9-14-15(19(14,3)4)18(23)24-10-20-16(21)12-7-5-6-8-13(12)17(20)22/h9,14-15H,5-8,10H2,1-4H3
49 atoms
O  -0.631116 0.878942 1.300744
O  -1.383209 2.945301 0.864131
O  1.617945 2.383075 -0.582874
O  2.15571 -1.044284 2.344246
N  1.691883 0.88325 1.164865
C  -2.347107 0.309523 -1.272597
C  -2.857173 -0.377731 -0.038954
C  -2.584725 1.109499 -0.000708
C  -0.942362 0.003568 -1.733668
C  -3.291122 0.595613 -2.41502
C  -4.255269 -0.843101 0.08528
C  -1.487176 1.745998 0.749484
C  -4.65349 -2.080067 0.399263
C  0.567638 1.355074 1.902892
C  -6.111514 -2.410994 0.510406
C  -3.733049 -3.231836 0.665796
C  3.116605 0.480058 -0.601454
C  3.269626 -0.530328 0.256479
C  3.8780 0.651154 -1.862046
C  4.214244 -1.660539 0.084799
C  5.089476 -0.282815 -1.853615
C  4.72823 -1.68137 -1.3558
C  2.074342 1.390446 -0.072139
C  2.338775 -0.327694 1.392589
H  -2.115403 -0.993604 0.456604
H  -3.456813 1.753641 -0.045875
H  -0.479102 0.879349 -2.192188
H  -0.292222 -0.349357 -0.93501
H  -0.973479 -0.781332 -2.491715
H  -2.907879 1.410393 -3.03194
H  -3.390904 -0.283549 -3.054639
H  -4.288243 0.878565 -2.080377
H  -5.023425 -0.096166 -0.094481
H  0.613101 0.953191 2.911754
H  0.588795 2.440468 1.956234
H  -6.746003 -1.543668 0.329164
H  -6.392691 -3.190902 -0.201843
H  -6.349237 -2.801466 1.503368
H  -3.984349 -4.074823 0.017339
H  -2.6814 -2.999967 0.510064
H  -3.849104 -3.590038 1.69186
H  3.223542 0.429812 -2.71107
H  4.186667 1.691995 -1.98125
H  5.043164 -1.544791 0.790173
H  3.729022 -2.60485 0.341538
H  5.512438 -0.339951 -2.85708
H  5.864587 0.141129 -1.209233
H  5.595638 -2.33872 -1.423471
H  3.95886 -2.10801 -2.005166
elementType: O N C H
totalener: -1094.86843942 hartree
nucrepener: 2126.48755653 hartree
electener: -3221.35599595 hartree
oneelecener: -5714.76348119 hartree
twoeener: 2493.40748524 hartree
cpcmener: -0.04135312 hartree
kineticenergy: 1090.03513269 hartree
xcener: -105.973539670415 hartree
chargesum: -0.0000000
charge: -0.274436 -0.481209 -0.429347 -0.433505 -0.084670 0.118763 0.077446 -0.148594 -0.278341 -0.271647 -0.309855 0.436622 -0.038062 0.062252 -0.222902 -0.254695 -0.014335 -0.078116 -0.072861 -0.066557 -0.134097 -0.137974 0.264840 0.346788 0.099339 0.093998 0.099615 0.080972 0.101555 0.099508 0.096245 0.089334 0.121939 0.128587 0.140238 0.088784 0.094312 0.093560 0.095051 0.090192 0.098029 0.102590 0.095237 0.101604 0.093392 0.081019 0.078703 0.081119 0.079570
qa: -0.2744 -0.4812 -0.4293 -0.4335 -0.0847 0.1188 0.0774 -0.1486 -0.2783 -0.2716 -0.3099 0.4366 -0.0381 0.0623 -0.2229 -0.2547 -0.0143 -0.0781 -0.0729 -0.0666 -0.1341 -0.1380 0.2648 0.3468 0.0993 0.0940 0.0996 0.0810 0.1016 0.0995 0.0962 0.0893 0.1219 0.1286 0.1402 0.0888 0.0943 0.0936 0.0951 0.0902 0.0980 0.1026 0.0952 0.1016 0.0934 0.0810 0.0787 0.0811 0.0796
va: 2.1091 2.0191 2.0714 2.0766 3.1013 3.6946 3.7161 3.8686 3.9075 3.9059 3.8594 4.1534 3.7465 3.8840 3.9228 3.9435 3.6074 3.7180 3.9174 3.9158 3.9162 3.9187 4.2055 4.1729 1.0246 1.0339 1.0056 1.0118 1.0025 1.0013 1.0024 1.0050 1.0095 1.0125 1.0182 1.0085 0.9963 0.9956 0.9977 1.0094 0.9965 1.0054 1.0153 1.0046 1.0159 1.0094 1.0065 1.0093 1.0065
dispcorr: -0.024573263 hartree
energy: -1094.893012686599
dipole: -13.76422 14.99730 1.23308 -18.24785 16.10563 -2.14222 -14.85305 13.64503 -1.20802
magnitude: 2.75117 au
magnitude: 6.99291 debye
