program: Orca
programVersion: 5.0.2
elementType: O O O O N C C C C C C C C C C C C C C C C C C C H H H H H H H H H H H H H H H H H H H H H H H H H
charge: 0
multiplicity: 1
keywords: wb97x-d3
keywords: def2-TZVPP
keywords: def2/J RIJCOSX
keywords: DEFGRID2
keywords: scfconv7
keywords: smallprint printgap noloewdin
keywords: NOSOSCF
formula: C19H25NO4
InChI: InChI=1/C19H25NO4/c1-11(2)9-14-15(19(14,3)4)18(23)24-10-20-16(21)12-7-5-6-8-13(12)17(20)22/h9,14-15H,5-8,10H2,1-4H3
49 atoms
O  -0.254673 1.233926 0.745458
O  -1.393279 2.057973 -1.003694
O  1.682116 0.292789 -1.654327
O  2.92827 1.577115 2.520516
N  2.042625 1.230787 0.416708
C  -3.777519 0.629228 0.488789
C  -3.355567 -0.165956 -0.705606
C  -2.309835 0.267554 0.293453
C  -4.258423 2.04461 0.289494
C  -4.475411 -0.082329 1.621079
C  -3.668031 -1.610865 -0.848211
C  -1.309099 1.277392 -0.085324
C  -4.737634 -2.090464 -1.488237
C  0.878646 2.051112 0.476862
C  -4.977179 -3.563652 -1.614582
C  -5.777055 -1.217918 -2.12144
C  3.559835 -0.362643 -0.267588
C  3.928068 0.024278 0.954794
C  4.280027 -1.356558 -1.100143
C  5.115803 -0.476526 1.687808
C  5.680238 -1.577449 -0.52571
C  5.65483 -1.729211 0.994635
C  2.332226 0.378611 -0.642009
C  2.952707 1.027945 1.447581
H  -3.350463 0.401147 -1.632342
H  -1.940951 -0.49853 0.966738
H  -3.864668 2.510163 -0.611164
H  -5.346693 2.047442 0.205062
H  -3.996371 2.675152 1.141193
H  -4.385714 0.487402 2.547661
H  -5.539382 -0.190872 1.40031
H  -4.072168 -1.078156 1.80172
H  -2.971472 -2.313833 -0.400521
H  0.991386 2.765847 1.289101
H  0.764031 2.597359 -0.45645
H  -4.195147 -4.150403 -1.133143
H  -5.934845 -3.844172 -1.168984
H  -5.026518 -3.863636 -2.664474
H  -6.763649 -1.436353 -1.705225
H  -5.588428 -0.154143 -1.986347
H  -5.84739 -1.413687 -3.194436
H  3.714299 -2.293526 -1.11148
H  4.330111 -1.021145 -2.138306
H  5.876928 0.309851 1.712108
H  4.862519 -0.683568 2.729888
H  6.126887 -2.461312 -0.982242
H  6.315888 -0.729437 -0.79501
H  6.657103 -1.945995 1.365368
H  5.029117 -2.584957 1.261824
elementType: O N C H
totalener: -1094.86875180 hartree
nucrepener: 2050.49632344 hartree
electener: -3145.36507524 hartree
oneelecener: -5563.38056782 hartree
twoeener: 2418.01549257 hartree
cpcmener: -0.03816998 hartree
kineticenergy: 1090.03917287 hartree
xcener: -105.973012465368 hartree
chargesum: 0.0000000
charge: -0.286605 -0.485389 -0.437555 -0.434878 -0.099944 0.130304 -0.011307 -0.131463 -0.296252 -0.271754 -0.254728 0.440155 -0.042551 0.080449 -0.230344 -0.249262 -0.056074 -0.082261 -0.073435 -0.069189 -0.133897 -0.135416 0.338994 0.342410 0.099153 0.097264 0.093317 0.097274 0.104181 0.101077 0.097490 0.093294 0.124303 0.126827 0.140679 0.090405 0.094736 0.095424 0.097132 0.087196 0.101783 0.102357 0.092797 0.101651 0.093675 0.080663 0.078106 0.080876 0.078337
qa: -0.2866 -0.4854 -0.4376 -0.4349 -0.0999 0.1303 -0.0113 -0.1315 -0.2963 -0.2718 -0.2547 0.4402 -0.0426 0.0804 -0.2303 -0.2493 -0.0561 -0.0823 -0.0734 -0.0692 -0.1339 -0.1354 0.3390 0.3424 0.0992 0.0973 0.0933 0.0973 0.1042 0.1011 0.0975 0.0933 0.1243 0.1268 0.1407 0.0904 0.0947 0.0954 0.0971 0.0872 0.1018 0.1024 0.0928 0.1017 0.0937 0.0807 0.0781 0.0809 0.0783
va: 2.1068 2.0231 2.0736 2.0765 3.1092 3.6760 3.7950 3.8578 3.9015 3.9076 3.8591 4.1528 3.7069 3.8532 3.9276 3.9380 3.6710 3.7140 3.9208 3.9183 3.9152 3.9190 4.1947 4.1982 1.0247 1.0357 1.0167 1.0003 0.9994 1.0028 1.0009 1.0020 1.0061 1.0130 1.0177 1.0071 0.9961 0.9952 0.9976 1.0080 0.9987 1.0046 1.0155 1.0044 1.0154 1.0095 1.0069 1.0095 1.0065
dispcorr: -0.022574303 hartree
energy: -1094.891326099842
dipole: -22.63914 23.52407 0.88493 -16.05224 14.43459 -1.61765 -3.20229 3.80245 0.60017
magnitude: 1.93910 au
magnitude: 4.92880 debye
