program: Orca
programVersion: 5.0.2
elementType: O O O O N C C C C C C C C C C C C C C C C C C C H H H H H H H H H H H H H H H H H H H H H H H H H
charge: 0
multiplicity: 1
keywords: wb97x-d3
keywords: def2-TZVPP
keywords: def2/J RIJCOSX
keywords: DEFGRID2
keywords: scfconv7
keywords: smallprint printgap noloewdin
keywords: NOSOSCF
formula: C19H25NO4
InChI: InChI=1/C19H25NO4/c1-11(2)9-14-15(19(14,3)4)18(23)24-10-20-16(21)12-7-5-6-8-13(12)17(20)22/h9,14-15H,5-8,10H2,1-4H3
49 atoms
O  -0.278549 1.371375 0.787222
O  -1.317611 1.968404 -1.113365
O  1.588315 0.36971 -1.646147
O  2.929161 1.629396 2.506684
N  2.016578 1.318413 0.408101
C  -3.753785 0.705027 0.481694
C  -3.328093 -0.17499 -0.653919
C  -2.288815 0.320197 0.324584
C  -4.211319 2.109559 0.179558
C  -4.468144 0.082895 1.656136
C  -3.643691 -1.622943 -0.694738
C  -1.2786 1.298394 -0.109445
C  -4.53424 -2.197273 -1.508731
C  0.867736 2.160428 0.496122
C  -4.765776 -3.677726 -1.479987
C  -5.375273 -1.447708 -2.495671
C  3.447392 -0.356023 -0.270973
C  3.849906 0.02924 0.941277
C  4.085364 -1.418799 -1.084808
C  5.027573 -0.513578 1.661256
C  5.047137 -2.222415 -0.207752
C  5.891326 -1.316156 0.687183
C  2.254577 0.441562 -0.643194
C  2.923043 1.076069 1.435642
H  -3.309573 0.326052 -1.616926
H  -1.930764 -0.39727 1.054906
H  -3.963132 2.787998 0.998231
H  -3.78394 2.513472 -0.735844
H  -5.296543 2.122594 0.062434
H  -5.532933 -0.024254 1.439409
H  -4.080341 -0.903784 1.906569
H  -4.372986 0.712719 2.542322
H  -3.101742 -2.258182 0.000119
H  1.010371 2.863216 1.313483
H  0.745458 2.719991 -0.428134
H  -4.572651 -4.123259 -2.459451
H  -4.1306 -4.17987 -0.750496
H  -5.80669 -3.906658 -1.237446
H  -5.200832 -1.811906 -3.511843
H  -6.436532 -1.611521 -2.290029
H  -5.201578 -0.372668 -2.490081
H  3.323379 -2.066409 -1.525212
H  4.61678 -0.962561 -1.925962
H  5.601517 0.297511 2.115695
H  4.686013 -1.1438 2.488667
H  4.473626 -2.91362 0.416427
H  5.693472 -2.832295 -0.839658
H  6.46458 -0.625191 0.062495
H  6.616484 -1.909135 1.245646
elementType: O N C H
totalener: -1094.86934506 hartree
nucrepener: 2057.99925708 hartree
electener: -3152.86860214 hartree
oneelecener: -5578.47946495 hartree
twoeener: 2425.61086281 hartree
cpcmener: -0.03943064 hartree
kineticenergy: 1090.02594165 hartree
xcener: -105.970684123150 hartree
chargesum: 0.0000000
charge: -0.286052 -0.482457 -0.436537 -0.434579 -0.102924 0.149520 0.005556 -0.156306 -0.288580 -0.263460 -0.276394 0.443488 -0.033078 0.080460 -0.229045 -0.252427 -0.056791 -0.081149 -0.070548 -0.073147 -0.133931 -0.135263 0.334781 0.345372 0.095572 0.096180 0.101894 0.091241 0.096883 0.096847 0.091080 0.099073 0.123616 0.127000 0.140700 0.095276 0.090024 0.094369 0.097919 0.096544 0.088790 0.094443 0.101195 0.094428 0.102871 0.078395 0.080098 0.078258 0.080793
qa: -0.2861 -0.4825 -0.4365 -0.4346 -0.1029 0.1495 0.0056 -0.1563 -0.2886 -0.2635 -0.2764 0.4435 -0.0331 0.0805 -0.2290 -0.2524 -0.0568 -0.0811 -0.0705 -0.0731 -0.1339 -0.1353 0.3348 0.3454 0.0956 0.0962 0.1019 0.0912 0.0969 0.0968 0.0911 0.0991 0.1236 0.1270 0.1407 0.0953 0.0900 0.0944 0.0979 0.0965 0.0888 0.0944 0.1012 0.0944 0.1029 0.0784 0.0801 0.0783 0.0808
va: 2.1082 2.0258 2.0747 2.0771 3.1080 3.6734 3.7669 3.8827 3.9062 3.9050 3.8738 4.1484 3.7077 3.8617 3.9247 3.9444 3.6740 3.7098 3.9183 3.9186 3.9155 3.9143 4.1985 4.1967 1.0275 1.0378 0.9991 1.0163 1.0009 1.0029 1.0024 1.0028 1.0071 1.0141 1.0170 0.9953 1.0078 0.9961 0.9976 0.9972 1.0079 1.0151 1.0049 1.0152 1.0050 1.0068 1.0097 1.0069 1.0095
dispcorr: -0.022345408 hartree
energy: -1094.891690466678
dipole: -21.99801 22.83976 0.84174 -16.89301 15.29811 -1.59490 -3.51559 4.17282 0.65724
magnitude: 1.91942 au
magnitude: 4.87878 debye
