program: Orca
programVersion: 5.0.2
elementType: O O O O N C C C C C C C C C C C C C C C C C C C H H H H H H H H H H H H H H H H H H H H H H H H H
charge: 0
multiplicity: 1
keywords: wb97x-d3
keywords: def2-TZVPP
keywords: def2/J RIJCOSX
keywords: DEFGRID2
keywords: scfconv7
keywords: smallprint printgap noloewdin
keywords: NOSOSCF
formula: C19H25NO4
InChI: InChI=1/C19H25NO4/c1-11(2)9-14-15(19(14,3)4)18(23)24-10-20-16(21)12-7-5-6-8-13(12)17(20)22/h9,14-15H,5-8,10H2,1-4H3
49 atoms
O  -0.280507 1.348871 0.793756
O  -1.320667 1.982084 -1.09411
O  1.678859 0.474691 -1.694828
O  2.845776 1.498199 2.574097
N  2.01691 1.30168 0.428333
C  -3.757668 0.690808 0.489425
C  -3.333726 -0.170473 -0.660024
C  -2.292447 0.312745 0.31954
C  -4.226858 2.095382 0.206133
C  -4.459842 0.050092 1.660152
C  -3.644166 -1.61952 -0.723761
C  -1.281794 1.295879 -0.100923
C  -4.588956 -2.168177 -1.49239
C  0.867904 2.141192 0.520421
C  -4.813411 -3.649656 -1.506757
C  -5.49674 -1.381322 -2.387116
C  3.491068 -0.317714 -0.291881
C  3.835885 -0.009231 0.959121
C  4.193743 -1.299471 -1.152829
C  4.975488 -0.600769 1.701531
C  5.555278 -1.633704 -0.539577
C  5.466459 -1.851745 0.970918
C  2.303598 0.489298 -0.663282
C  2.885334 1.006506 1.474338
H  -3.323069 0.346108 -1.615013
H  -1.931102 -0.41517 1.037958
H  -3.800711 2.516622 -0.702417
H  -5.312037 2.097901 0.084616
H  -3.989929 2.765429 1.034872
H  -4.357717 0.667479 2.554058
H  -5.526002 -0.05726 1.453024
H  -4.06608 -0.938147 1.892372
H  -3.050307 -2.273898 -0.091942
H  1.002972 2.833515 1.347684
H  0.753564 2.712353 -0.397482
H  -5.83694 -3.893508 -1.210851
H  -4.678023 -4.055785 -2.512616
H  -4.133194 -4.175474 -0.837143
H  -5.324572 -0.307268 -2.344842
H  -5.390427 -1.699139 -3.427438
H  -6.541033 -1.558779 -2.117796
H  3.578488 -2.200048 -1.246289
H  4.307326 -0.906021 -2.165421
H  5.776486 0.141432 1.777448
H  4.682229 -0.835065 2.727175
H  5.962774 -2.522763 -1.021549
H  6.252098 -0.816987 -0.74692
H  6.440968 -2.142399 1.363687
H  4.783651 -2.679794 1.177525
elementType: O N C H
totalener: -1094.86935533 hartree
nucrepener: 2055.65425679 hartree
electener: -3150.52361213 hartree
oneelecener: -5573.74711302 hartree
twoeener: 2423.22350090 hartree
cpcmener: -0.03944749 hartree
kineticenergy: 1090.03676092 hartree
xcener: -105.972613367845 hartree
chargesum: -0.0000000
charge: -0.284317 -0.483535 -0.436236 -0.434265 -0.102367 0.151483 -0.003800 -0.154001 -0.290656 -0.264862 -0.268743 0.444235 -0.034111 0.079131 -0.229804 -0.251875 -0.059891 -0.078321 -0.072865 -0.069945 -0.135037 -0.134906 0.338900 0.342600 0.096522 0.096303 0.090959 0.097079 0.102136 0.099363 0.096847 0.091663 0.123134 0.127374 0.139380 0.094274 0.095464 0.090115 0.087817 0.098561 0.096738 0.102808 0.093889 0.101451 0.093336 0.080773 0.078096 0.080330 0.078776
qa: -0.2843 -0.4835 -0.4362 -0.4343 -0.1024 0.1515 -0.0038 -0.1540 -0.2907 -0.2649 -0.2687 0.4442 -0.0341 0.0791 -0.2298 -0.2519 -0.0599 -0.0783 -0.0729 -0.0699 -0.1350 -0.1349 0.3389 0.3426 0.0965 0.0963 0.0910 0.0971 0.1021 0.0994 0.0968 0.0917 0.1231 0.1274 0.1394 0.0943 0.0955 0.0901 0.0878 0.0986 0.0967 0.1028 0.0939 0.1015 0.0933 0.0808 0.0781 0.0803 0.0788
va: 2.1090 2.0258 2.0748 2.0769 3.1086 3.6716 3.7746 3.8779 3.9053 3.9051 3.8724 4.1511 3.7026 3.8637 3.9258 3.9435 3.6700 3.7080 3.9193 3.9180 3.9165 3.9188 4.1975 4.1962 1.0261 1.0375 1.0162 1.0008 0.9994 1.0028 1.0028 1.0022 1.0071 1.0131 1.0184 0.9961 0.9951 1.0076 1.0079 0.9979 0.9973 1.0046 1.0151 1.0043 1.0156 1.0094 1.0067 1.0097 1.0065
dispcorr: -0.022397017 hartree
energy: -1094.891752349521
dipole: -22.14406 22.99969 0.85563 -16.66429 15.07366 -1.59063 -3.49040 4.13930 0.64890
magnitude: 1.91919 au
magnitude: 4.87819 debye
