program: Orca
programVersion: 5.0.2
elementType: O O O O N C C C C C C C C C C C C C C C C C C C H H H H H H H H H H H H H H H H H H H H H H H H H
charge: 0
multiplicity: 1
keywords: wb97x-d3
keywords: def2-TZVPP
keywords: def2/J RIJCOSX
keywords: DEFGRID2
keywords: scfconv7
keywords: smallprint printgap noloewdin
keywords: NOSOSCF
formula: C19H25NO4
InChI: InChI=1/C19H25NO4/c1-11(2)9-14-15(19(14,3)4)18(23)24-10-20-16(21)12-7-5-6-8-13(12)17(20)22/h9,14-15H,5-8,10H2,1-4H3
49 atoms
O  -0.395697 0.908361 -0.701921
O  -1.772184 2.033408 0.666008
O  2.862346 1.16337 -2.341708
O  1.387389 0.725583 1.931148
N  1.851337 1.225879 -0.267751
C  -2.77253 -0.900888 1.2407
C  -3.767752 -0.176606 0.402739
C  -2.316107 -0.190321 -0.030939
C  -2.411876 -0.345466 2.596462
C  -2.71402 -2.408024 1.18169
C  -4.792514 -0.887175 -0.40586
C  -1.507261 1.034232 0.038981
C  -5.298267 -0.441043 -1.558565
C  0.630774 1.886362 -0.593815
C  -6.362876 -1.199123 -2.29029
C  -4.870035 0.840949 -2.2033
C  3.837246 0.070762 -0.414212
C  3.399028 -0.075037 0.837327
C  5.114472 -0.467671 -0.940642
C  4.09635 -0.835349 1.902469
C  5.999009 -0.909373 0.226726
C  5.208648 -1.68295 1.280984
C  2.842262 0.86617 -1.173718
C  2.107395 0.642075 0.966747
H  -4.087012 0.778375 0.813583
H  -2.062172 -0.851994 -0.850999
H  -3.023642 -0.830352 3.359403
H  -1.366021 -0.542861 2.839939
H  -2.58282 0.725294 2.680606
H  -2.916252 -2.796874 0.183883
H  -1.72579 -2.76218 1.480291
H  -3.442129 -2.847743 1.866336
H  -5.172168 -1.821658 -0.001848
H  0.395841 2.631573 0.162422
H  0.74529 2.383989 -1.554261
H  -6.03653 -1.451949 -3.302174
H  -6.634201 -2.12347 -1.780717
H  -7.26732 -0.595417 -2.400355
H  -5.693721 1.560001 -2.20872
H  -4.023364 1.311956 -1.706768
H  -4.600237 0.677422 -3.249414
H  4.906505 -1.307478 -1.610777
H  5.618908 0.286464 -1.549074
H  4.505319 -0.135368 2.637532
H  3.386402 -1.463077 2.446003
H  6.819024 -1.52208 -0.149393
H  6.452078 -0.027436 0.688109
H  5.878272 -2.035631 2.066013
H  4.76891 -2.571956 0.820668
elementType: O N C H
totalener: -1094.86818394 hartree
nucrepener: 2082.79072650 hartree
electener: -3177.65891044 hartree
oneelecener: -5627.95062712 hartree
twoeener: 2450.29171668 hartree
cpcmener: -0.03658552 hartree
kineticenergy: 1090.04101817 hartree
xcener: -105.973615014851 hartree
chargesum: -0.0000000
charge: -0.284261 -0.486129 -0.434706 -0.441229 -0.097708 0.158098 -0.019427 -0.116180 -0.280504 -0.288936 -0.292650 0.410174 -0.016464 0.080735 -0.227204 -0.245180 -0.083725 -0.050673 -0.075106 -0.069133 -0.133325 -0.137215 0.347313 0.332515 0.104108 0.097229 0.098869 0.095111 0.093755 0.094789 0.098517 0.099812 0.124855 0.141059 0.126556 0.095238 0.089950 0.095750 0.103809 0.082256 0.095751 0.103260 0.094730 0.101261 0.094953 0.081112 0.078267 0.081053 0.078871
qa: -0.2843 -0.4861 -0.4347 -0.4412 -0.0977 0.1581 -0.0194 -0.1162 -0.2805 -0.2889 -0.2926 0.4102 -0.0165 0.0807 -0.2272 -0.2452 -0.0837 -0.0507 -0.0751 -0.0691 -0.1333 -0.1372 0.3473 0.3325 0.1041 0.0972 0.0989 0.0951 0.0938 0.0948 0.0985 0.0998 0.1249 0.1411 0.1266 0.0952 0.0899 0.0958 0.1038 0.0823 0.0958 0.1033 0.0947 0.1013 0.0950 0.0811 0.0783 0.0811 0.0789
va: 2.1013 2.0161 2.0770 2.0644 3.1064 3.6950 3.8266 3.8204 3.8867 3.9122 3.8861 4.1227 3.7096 3.8604 3.9280 3.9395 3.7175 3.6732 3.9195 3.9148 3.9137 3.9175 4.1941 4.1853 1.0238 1.0311 1.0023 1.0057 1.0162 1.0011 1.0027 0.9995 1.0026 1.0161 1.0136 0.9971 1.0063 0.9953 0.9979 1.0124 0.9996 1.0048 1.0150 1.0051 1.0146 1.0098 1.0066 1.0092 1.0066
dispcorr: -0.023236549 hartree
energy: -1094.891420489694
dipole: -15.98200 17.40242 1.42043 -15.49885 13.79423 -1.70462 1.31472 -1.46707 -0.15235
magnitude: 2.22408 au
magnitude: 5.65317 debye
