program: Orca
programVersion: 5.0.2
elementType: O O O O N C C C C C C C C C C C C C C C C C C C H H H H H H H H H H H H H H H H H H H H H H H H H
charge: 0
multiplicity: 1
keywords: wb97x-d3
keywords: def2-TZVPP
keywords: def2/J RIJCOSX
keywords: DEFGRID2
keywords: scfconv7
keywords: smallprint printgap noloewdin
keywords: NOSOSCF
formula: C19H25NO4
InChI: InChI=1/C19H25NO4/c1-11(2)9-14-15(19(14,3)4)18(23)24-10-20-16(21)12-7-5-6-8-13(12)17(20)22/h9,14-15H,5-8,10H2,1-4H3
49 atoms
O  -0.508905 1.665194 1.193603
O  -0.634051 1.397619 -1.021453
O  2.39561 2.130757 -1.377985
O  1.731395 -0.051792 2.554715
N  1.774425 1.292408 0.685315
C  -3.698531 1.129556 -0.445154
C  -3.114817 -0.241552 -0.586594
C  -2.472513 0.751043 0.371658
C  -3.58366 2.079339 -1.612179
C  -4.972135 1.33022 0.341134
C  -3.765565 -1.4461 -0.038441
C  -1.13731 1.291951 0.069936
C  -3.847228 -2.647711 -0.61983
C  0.784407 2.24147 1.081286
C  -4.550493 -3.781285 0.0655
C  -3.281063 -2.995484 -1.962235
C  3.358405 0.100544 -0.486259
C  3.167494 -0.541609 0.66638
C  4.311057 -0.311513 -1.545857
C  3.858145 -1.790207 1.072152
C  5.264789 -1.371924 -0.991415
C  4.531787 -2.415965 -0.149831
C  2.476417 1.295461 -0.51634
C  2.158243 0.20373 1.457822
H  -2.5531 -0.383754 -1.503311
H  -2.662975 0.586161 1.42633
H  -2.733982 1.869984 -2.257192
H  -4.483088 2.006873 -2.227122
H  -3.503619 3.114015 -1.271781
H  -5.842133 1.08807 -0.272807
H  -5.022891 0.721268 1.242719
H  -5.066285 2.373688 0.648186
H  -4.221767 -1.334357 0.940802
H  1.004887 2.623268 2.07542
H  0.793976 3.072711 0.376596
H  -5.366856 -4.167551 -0.550786
H  -3.86968 -4.620189 0.234398
H  -4.967388 -3.488466 1.029155
H  -2.59173 -3.839623 -1.881396
H  -4.075404 -3.314769 -2.641535
H  -2.74643 -2.180055 -2.444661
H  3.75164 -0.701509 -2.402356
H  4.863498 0.554225 -1.919113
H  4.596799 -1.559202 1.846461
H  3.150444 -2.485799 1.529304
H  5.791248 -1.85589 -1.815251
H  6.027298 -0.884535 -0.377155
H  5.226253 -3.193037 0.172602
H  3.7734 -2.909059 -0.764894
elementType: O N C H
totalener: -1094.88035632 hartree
nucrepener: 2094.88314034 hartree
electener: -3189.76349665 hartree
oneelecener: -5652.43628139 hartree
twoeener: 2462.67278473 hartree
cpcmener: -0.03317794 hartree
kineticenergy: 1090.04062545 hartree
xcener: -105.972145510234 hartree
chargesum: 0.0000000
charge: -0.284413 -0.464188 -0.402681 -0.410094 -0.100615 0.098415 0.041253 -0.108338 -0.274797 -0.272253 -0.271459 0.417606 -0.050767 0.085091 -0.217323 -0.251249 -0.069264 -0.085741 -0.073172 -0.075994 -0.136873 -0.134151 0.321814 0.316097 0.095447 0.087119 0.093734 0.094728 0.097739 0.097834 0.088674 0.097151 0.115921 0.144952 0.131372 0.092325 0.093284 0.087756 0.094666 0.096068 0.089393 0.101369 0.093345 0.100171 0.093219 0.080782 0.077722 0.080179 0.078146
qa: -0.2844 -0.4642 -0.4027 -0.4101 -0.1006 0.0984 0.0413 -0.1083 -0.2748 -0.2723 -0.2715 0.4176 -0.0508 0.0851 -0.2173 -0.2512 -0.0693 -0.0857 -0.0732 -0.0760 -0.1369 -0.1342 0.3218 0.3161 0.0954 0.0871 0.0937 0.0947 0.0977 0.0978 0.0887 0.0972 0.1159 0.1450 0.1314 0.0923 0.0933 0.0878 0.0947 0.0961 0.0894 0.1014 0.0933 0.1002 0.0932 0.0808 0.0777 0.0802 0.0781
va: 2.1162 2.0474 2.1140 2.1076 3.0755 3.6941 3.7770 3.8208 3.9034 3.9145 3.8813 4.1628 3.7710 3.8847 3.9200 3.9404 3.6518 3.6876 3.9193 3.9229 3.9144 3.9139 4.2169 4.2195 1.0289 1.0363 1.0203 0.9999 0.9997 1.0015 1.0071 1.0016 1.0120 0.9939 1.0178 0.9962 0.9964 1.0092 0.9970 0.9970 1.0114 1.0048 1.0160 1.0046 1.0157 1.0093 1.0067 1.0094 1.0069
dispcorr: -0.022429240 hartree
energy: -1094.902785556319
dipole: -19.21524 19.57248 0.35725 -17.35657 16.18430 -1.17227 -8.29202 8.47721 0.18519
magnitude: 1.23941 au
magnitude: 3.15033 debye
