program: Orca
programVersion: 5.0.2
elementType: O O O O N C C C C C C C C C C C C C C C C C C C H H H H H H H H H H H H H H H H H H H H H H H H H
charge: 0
multiplicity: 1
keywords: wb97x-d3
keywords: def2-TZVPP
keywords: def2/J RIJCOSX
keywords: DEFGRID2
keywords: scfconv7
keywords: smallprint printgap noloewdin
keywords: NOSOSCF
formula: C19H25NO4
InChI: InChI=1/C19H25NO4/c1-11(2)9-14-15(19(14,3)4)18(23)24-10-20-16(21)12-7-5-6-8-13(12)17(20)22/h9,14-15H,5-8,10H2,1-4H3
49 atoms
O  -0.477581 1.594593 1.209076
O  -0.622505 1.342487 -1.007615
O  2.400253 2.140144 -1.371711
O  1.799785 -0.103375 2.536517
N  1.810061 1.267669 0.686327
C  -3.68442 1.089506 -0.371865
C  -3.120447 -0.287104 -0.550112
C  -2.442697 0.678756 0.404587
C  -3.58869 2.05537 -1.526679
C  -4.93723 1.283157 0.448804
C  -3.783978 -1.485284 0.001612
C  -1.111738 1.223027 0.0883
C  -4.071648 -2.613505 -0.655533
C  0.804591 2.193295 1.098393
C  -4.768365 -3.745689 0.038518
C  -3.759565 -2.869637 -2.098042
C  3.403398 0.116296 -0.512109
C  3.230107 -0.544966 0.632341
C  4.352289 -0.26693 -1.585506
C  3.936746 -1.792383 1.012657
C  5.322076 -1.325954 -1.056994
C  4.608611 -2.390971 -0.224439
C  2.502913 1.297204 -0.520001
C  2.215896 0.174565 1.441134
H  -2.590505 -0.426426 -1.486797
H  -2.61038 0.496918 1.460577
H  -2.753127 1.850663 -2.191677
H  -4.500753 1.99512 -2.123984
H  -3.497394 3.084703 -1.174303
H  -5.823559 1.043103 -0.142277
H  -4.961422 0.667737 1.347048
H  -5.026047 2.324161 0.765716
H  -4.07136 -1.427141 1.047504
H  1.022342 2.564527 2.096909
H  0.79729 3.034349 0.405495
H  -5.713846 -3.986027 -0.455343
H  -4.165427 -4.657269 0.008191
H  -4.984206 -3.520939 1.083177
H  -3.148947 -3.769944 -2.206393
H  -4.678793 -3.0549 -2.659989
H  -3.235103 -2.052595 -2.589643
H  3.790441 -0.647407 -2.444736
H  4.892669 0.611459 -1.947187
H  4.67731 -1.568713 1.787169
H  3.23841 -2.502943 1.461018
H  5.84443 -1.791842 -1.893772
H  6.086304 -0.8406 -0.443235
H  5.315747 -3.163879 0.081004
H  3.851291 -2.884785 -0.840626
elementType: O N C H
totalener: -1094.88025056 hartree
nucrepener: 2089.07597389 hartree
electener: -3183.95622445 hartree
oneelecener: -5640.82183616 hartree
twoeener: 2456.86561171 hartree
cpcmener: -0.03315859 hartree
kineticenergy: 1090.04346527 hartree
xcener: -105.972266328481 hartree
chargesum: -0.0000000
charge: -0.282967 -0.462576 -0.402679 -0.409896 -0.101220 0.106692 0.045587 -0.123528 -0.278494 -0.266710 -0.273938 0.417681 -0.048517 0.084946 -0.217795 -0.250911 -0.069088 -0.085258 -0.072960 -0.075726 -0.137123 -0.134456 0.321027 0.316314 0.094086 0.086593 0.094013 0.094969 0.098144 0.097318 0.087747 0.097372 0.116996 0.144524 0.131453 0.092729 0.092845 0.087584 0.094970 0.095642 0.089319 0.101600 0.093432 0.100215 0.093012 0.080760 0.077715 0.080248 0.078312
qa: -0.2830 -0.4626 -0.4027 -0.4099 -0.1012 0.1067 0.0456 -0.1235 -0.2785 -0.2667 -0.2739 0.4177 -0.0485 0.0849 -0.2178 -0.2509 -0.0691 -0.0853 -0.0730 -0.0757 -0.1371 -0.1345 0.3210 0.3163 0.0941 0.0866 0.0940 0.0950 0.0981 0.0973 0.0877 0.0974 0.1170 0.1445 0.1315 0.0927 0.0928 0.0876 0.0950 0.0956 0.0893 0.1016 0.0934 0.1002 0.0930 0.0808 0.0777 0.0802 0.0783
va: 2.1154 2.0495 2.1140 2.1078 3.0763 3.6868 3.7700 3.8487 3.9047 3.9116 3.8733 4.1594 3.7616 3.8861 3.9207 3.9416 3.6514 3.6872 3.9194 3.9225 3.9146 3.9137 4.2168 4.2191 1.0305 1.0382 1.0199 1.0000 0.9995 1.0021 1.0064 1.0020 1.0110 0.9938 1.0174 0.9961 0.9964 1.0090 0.9971 0.9973 1.0105 1.0048 1.0159 1.0047 1.0157 1.0093 1.0066 1.0094 1.0068
dispcorr: -0.022464086 hartree
energy: -1094.902714647571
dipole: -20.37128 20.69719 0.32591 -16.81931 15.69640 -1.12291 -8.43717 8.60240 0.16523
magnitude: 1.18087 au
magnitude: 3.00154 debye
