program: Orca
programVersion: 5.0.2
elementType: O O O O N C C C C C C C C C C C C C C C C C C C H H H H H H H H H H H H H H H H H H H H H H H H H
charge: 0
multiplicity: 1
keywords: wb97x-d3
keywords: def2-TZVPP
keywords: def2/J RIJCOSX
keywords: DEFGRID2
keywords: scfconv7
keywords: smallprint printgap noloewdin
keywords: NOSOSCF
formula: C19H25NO4
InChI: InChI=1/C19H25NO4/c1-11(2)9-14-15(19(14,3)4)18(23)24-10-20-16(21)12-7-5-6-8-13(12)17(20)22/h9,14-15H,5-8,10H2,1-4H3
49 atoms
O  -0.317083 1.33706 -0.029809
O  -1.481715 0.990171 1.855457
O  2.972902 2.828543 -1.048893
O  1.555382 -0.656611 1.49568
N  1.964686 1.299115 0.354163
C  -2.556377 -1.41585 0.12627
C  -3.604685 -0.352131 0.263406
C  -2.220479 0.031553 -0.205368
C  -2.010731 -2.064667 1.374128
C  -2.621044 -2.359694 -1.048972
C  -4.737718 -0.238477 -0.682772
C  -1.336425 0.818984 0.670926
C  -6.030608 -0.39216 -0.381742
C  0.747343 1.976627 0.661078
C  -7.089009 -0.23977 -1.432123
C  -6.5461 -0.723622 0.985169
C  3.981237 0.68013 -0.5663
C  3.562178 -0.348518 0.172329
C  5.262162 0.727033 -1.313141
C  4.286659 -1.631133 0.34148
C  6.167175 -0.412336 -0.840265
C  5.40147 -1.726967 -0.701986
C  2.961047 1.757789 -0.498903
C  2.256681 0.010684 0.778382
H  -3.81893 -0.072588 1.289951
H  -2.105892 0.236084 -1.264663
H  -2.586911 -2.965262 1.597189
H  -0.970681 -2.368887 1.237898
H  -2.062009 -1.424017 2.251736
H  -3.313585 -3.178335 -0.840817
H  -2.951797 -1.873414 -1.966268
H  -1.640463 -2.798567 -1.243709
H  -4.481668 -0.011275 -1.713892
H  0.577692 1.980645 1.735965
H  0.821972 3.00404 0.310083
H  -6.670906 0.016168 -2.40583
H  -7.666397 -1.161291 -1.545744
H  -7.805159 0.539969 -1.158287
H  -7.161589 -1.626525 0.95176
H  -5.761647 -0.889558 1.721443
H  -7.193669 0.07384 1.360232
H  5.061189 0.643731 -2.386258
H  5.748174 1.69582 -1.173885
H  4.696205 -1.685678 1.35544
H  3.59434 -2.472084 0.252583
H  6.997349 -0.532893 -1.537753
H  6.606342 -0.145439 0.125316
H  6.084978 -2.533661 -0.433265
H  4.96652 -1.99503 -1.669174
elementType: O N C H
totalener: -1094.87938157 hartree
nucrepener: 2064.45057812 hartree
electener: -3159.32995969 hartree
oneelecener: -5591.27571337 hartree
twoeener: 2431.94575368 hartree
cpcmener: -0.03081415 hartree
kineticenergy: 1090.04235888 hartree
xcener: -105.971664684841 hartree
chargesum: 0.0000000
charge: -0.282792 -0.453515 -0.409358 -0.415058 -0.091768 0.137570 0.022070 -0.123276 -0.287851 -0.261663 -0.279333 0.392845 -0.031425 0.079019 -0.224342 -0.253091 -0.083301 -0.058404 -0.072958 -0.071230 -0.135363 -0.136294 0.324007 0.315147 0.094291 0.090857 0.097340 0.092849 0.096459 0.095957 0.088246 0.097957 0.118064 0.141975 0.123774 0.088000 0.093321 0.093236 0.093749 0.090121 0.096991 0.100866 0.092921 0.100515 0.093710 0.081367 0.078301 0.081070 0.078429
qa: -0.2828 -0.4535 -0.4094 -0.4151 -0.0918 0.1376 0.0221 -0.1233 -0.2879 -0.2617 -0.2793 0.3928 -0.0314 0.0790 -0.2243 -0.2531 -0.0833 -0.0584 -0.0730 -0.0712 -0.1354 -0.1363 0.3240 0.3151 0.0943 0.0909 0.0973 0.0928 0.0965 0.0960 0.0882 0.0980 0.1181 0.1420 0.1238 0.0880 0.0933 0.0932 0.0937 0.0901 0.0970 0.1009 0.0929 0.1005 0.0937 0.0814 0.0783 0.0811 0.0784
va: 2.1093 2.0570 2.1104 2.0986 3.0914 3.6774 3.7760 3.8769 3.8982 3.9042 3.8785 4.1847 3.7247 3.8541 3.9251 3.9445 3.6982 3.6623 3.9201 3.9187 3.9117 3.9141 4.2242 4.2143 1.0299 1.0377 1.0022 1.0074 1.0171 1.0032 1.0040 1.0029 1.0088 1.0160 1.0163 1.0089 0.9965 0.9955 0.9977 1.0083 0.9972 1.0052 1.0157 1.0053 1.0155 1.0095 1.0069 1.0094 1.0067
dispcorr: -0.022756095 hartree
energy: -1094.902137664310
dipole: -19.71400 20.91423 1.20022 -18.23263 17.03799 -1.19464 -5.40065 4.27766 -1.12299
magnitude: 2.03195 au
magnitude: 5.16480 debye
