program: Gaussian 09
title: 000067120
version: EM64L-G09RevD.01
frameworkgroup: C1[X(C16H16O3)]
method: RPBEPBE
basis: SDD
operation: Freq
keyword: #pfreq=noraman
keyword: PBEPBE/SDD
title: #p freq=noraman PBEPBE/SDD
converged: YES YES NO NO
title: Mulliken charges:
elementType: O O O C C C C C C C C C C C C C C C C H H H H H H H H H H H H H H H H
charge: -0.269549 -0.209052 -0.258568 -0.716965 0.525315 0.114157 0.303241 -0.374673 -0.394588 -0.312039 -0.356374 -0.359165 -0.361802 0.318623 0.334042 -0.377641 -0.355445 -0.538834 -0.536886 0.239036 0.240373 0.228477 0.225022 0.250487 0.277053 0.246362 0.236036 0.253713 0.245150 0.221730 0.243074 0.217762 0.226690 0.226320 0.248917
chargesum: 0.00000
title: Mulliken charges with hydrogens summed into heavy atoms:
elementType: O O O C C C C C C C C C C C C C C C C
charge: -0.269549 -0.209052 -0.258568 -0.237556 0.525315 0.114157 0.303241 -0.146196 -0.169566 -0.061551 -0.079320 -0.112803 -0.125765 0.318623 0.334042 -0.123928 -0.110295 0.143732 0.165041
polarizability: 3.17527481e+02 -1.51984159e+01 1.37795725e+02 -1.71247222e-01 5.71179016e-01 1.25876090e+02
1716.lowfreq: -19.3378 -9.3048 -2.9888 -0.0007 -0.0002 0.0005 5.7495 19.2405 35.7421
frequency: -19.2399 18.5644 35.7231 55.2376 78.1458 91.1704 123.2705 132.3731 163.1363 201.5432 217.8920 222.6952 242.7268 290.8677 302.3808 325.7728 355.5287 376.8698 412.8124 414.4132 439.4541 484.6263 497.4767 511.3695 523.7515 566.9313 584.6008 627.4979 634.4274 700.8544 715.8378 734.2233 763.8944 790.6372 812.7825 821.0095 824.2101 834.6504 853.1934 923.3357 935.1610 959.2214 968.7213 975.6573 982.6017 988.7080 990.1989 1003.8067 1005.9126 1108.3673 1111.6291 1113.5112 1113.8490 1156.6951 1156.9783 1165.6528 1170.2640 1181.4500 1210.9576 1225.2585 1230.9054 1240.1147 1294.4460 1305.0007 1306.9830 1372.8248 1384.9774 1418.2576 1427.4132 1436.5808 1437.1047 1444.1146 1466.8899 1468.3960 1472.2553 1474.0324 1498.9509 1506.1012 1564.2400 1589.3366 1590.6479 1622.5547 1629.0234 2956.4909 2968.2974 2971.1975 3024.2055 3042.9356 3059.8825 3120.8328 3122.4691 3124.9700 3131.5858 3144.2818 3146.1141 3161.4034 3165.3473 3166.2311 3171.3719
redmass: 3.9177 5.4316 5.1672 3.9202 4.4276 3.6898 5.6045 4.4120 4.2949 3.3142 2.0424 1.4464 1.2481 3.6780 4.7141 2.3841 5.8239 6.4026 2.9220 2.9536 4.3142 3.3593 4.0815 2.8128 4.7234 2.4913 5.4932 7.1112 6.8716 4.0183 4.3410 3.6078 4.2664 3.4451 1.7658 2.1157 1.2594 1.6163 2.4697 2.0945 1.4098 1.3616 1.4250 5.4365 8.3788 1.4465 6.3783 2.5815 2.4130 1.3734 1.2593 1.2615 1.3303 1.3442 1.3419 1.1353 1.2667 1.2209 1.6988 2.4823 4.3163 3.5376 1.9065 1.4562 1.2957 5.2406 5.3397 3.3511 3.8160 1.2235 1.1696 1.1372 1.0504 1.0509 1.0694 1.0729 2.4358 2.5685 7.6264 7.0781 7.5935 6.8037 6.6135 1.0331 1.0327 1.0601 1.0983 1.1037 1.1043 1.0912 1.0973 1.0896 1.1000 1.0882 1.0878 1.0937 1.0957 1.0953 1.0966
irintensity: 0.7077 1.0420 0.9345 3.5357 0.0040 3.1330 3.1421 7.5607 3.2879 5.0763 2.4435 1.6901 1.4818 1.6646 3.2026 1.5592 1.9681 0.4377 0.0712 0.0592 7.1656 5.0666 6.8444 13.3494 42.1622 17.7632 15.9528 3.6212 0.2181 8.3643 4.1492 0.0897 14.6891 15.0574 8.4314 11.7059 2.2853 78.2866 48.6247 0.3024 2.2846 0.9144 0.8132 105.9035 18.3231 2.1895 47.2139 1.7606 21.0359 11.4416 0.3778 0.4411 13.9046 0.5301 0.1143 23.2435 311.5965 29.0273 112.4884 10.2083 120.7239 296.0440 65.4462 65.6869 0.5326 45.5891 8.2882 1.6796 0.2469 14.3798 9.3872 10.8164 13.8024 16.9231 60.8835 49.1280 20.9949 132.1015 55.2388 25.4829 219.4296 92.6918 59.1685 75.9923 71.4822 38.8202 7.1730 51.1963 42.3840 31.9479 17.8934 16.0825 23.5969 10.8192 1.0393 18.1619 16.2440 4.6914 5.5450
temp: 298.150 k
press: 1.00000 atm
elementType: 8 8 8 6 6 6 6 6 6 6 6 6 6 6 6 6 6 6 6 1 1 1 1 1 1 1 1 1 1 1 1 1 1 1 1
symmnumber: 1
zpe: 729059.7 jmol-1
zpe.correction: 0.277684 hartree
zpe.thermalcorrener: 0.294682 hartree
zpe.thermalcorrenthalpy: 0.295627 hartree
zpe.thermalcorrgfe: 0.231541 hartree
zpe.sumelectzpe: -843.576121 hartree
zpe.sumelectthermal: -843.559123 hartree
zpe.sumelectthermalent: -843.558179 hartree
zpe.sumelectthermalfe: -843.622265 hartree
dipole: 3.0327 -0.4885 -1.6704
dipole: 3.4966
quadrupole: -75.3354 -111.3577 -108.3367
quadrupole: 6.5960 12.4033 -1.6534
quadrupole: 23.0079 -13.0144 -9.9934 6.5960 12.4033 -1.6534
hfenergy: -843.8538056 hartree
pointgroup: C01 [X(C16H16O3)]
dipole: 1.2010512 0.2350352 0.6282246 debye
polarizability: 317.502101|15.0308497|137.7948055|-3.1815475|-0.4161167|125.902389 unknown
InChI: InChI=1S/C16H16O3/c1-18-14-7-3-12(4-8-14)11-16(17)13-5-9-15(19-2)10-6-13/h3-10H,11H2,1-2H3
charge 0 multiplicity 1
35 atoms
O  -6.101223 -0.276839 -0.347888
O  -0.036841 -1.506962 -0.119432
O  6.122008 0.447661 0.077622
C  -0.475619 0.898086 0.126687
C  -1.958624 0.595835 0.037458
C  0.441024 -0.341768 -0.002555
C  1.923815 -0.117781 0.020476
C  -2.630737 0.616399 -1.213027
C  -2.708858 0.266153 1.188698
C  2.518224 1.168743 0.173627
C  2.780133 -1.242906 -0.115506
C  -4.002505 0.32265 -1.311063
C  -4.088473 -0.03383 1.114622
C  -4.737012 -0.003869 -0.144015
C  4.750616 0.18457 0.050406
C  3.912806 1.322164 0.189933
C  4.18001 -1.107455 -0.103141
C  -6.895432 -0.646412 0.824657
C  7.042561 -0.685929 -0.073042
H  -0.18037 1.621373 -0.659159
H  -0.236337 1.386589 1.093153
H  -2.071386 0.860866 -2.124423
H  -2.211515 0.233779 2.166018
H  1.891999 2.060049 0.281878
H  2.314021 -2.227322 -0.231583
H  -4.524317 0.337835 -2.272807
H  -4.634646 -0.285853 2.028616
H  4.380652 2.304111 0.30739
H  4.810847 -1.994682 -0.211319
H  -6.508973 -1.569721 1.299145
H  -7.910614 -0.824492 0.440159
H  -6.918328 0.171272 1.57195
H  6.898893 -1.190437 -1.047505
H  6.916324 -1.416104 0.74902
H  8.048074 -0.243673 -0.02705
