program: Orca
programVersion: 5.0.2
elementType: O O O O N C C C C C C C C C C C C C C C C C C C H H H H H H H H H H H H H H H H H H H H H H H H H
charge: 0
multiplicity: 1
keywords: wb97x-d3
keywords: def2-TZVPP
keywords: def2/J RIJCOSX
keywords: DEFGRID2
keywords: scfconv7
keywords: smallprint printgap noloewdin
keywords: NOSOSCF
formula: C19H25NO4
InChI: InChI=1/C19H25NO4/c1-11(2)9-14-15(19(14,3)4)18(23)24-10-20-16(21)12-7-5-6-8-13(12)17(20)22/h9,14-15H,5-8,10H2,1-4H3
49 atoms
O  -0.158105 0.775289 0.078853
O  -1.716007 2.191986 -0.655107
O  2.379764 0.279471 -2.14127
O  2.428433 1.412603 2.258102
N  2.107445 1.101228 -0.004649
C  -3.631863 0.226234 0.871752
C  -3.675878 -0.093728 -0.590314
C  -2.337432 0.002502 0.103701
C  -4.033541 1.607296 1.325485
C  -3.997179 -0.853201 1.860616
C  -4.126967 -1.41596 -1.093162
C  -1.417579 1.110093 -0.206628
C  -5.352939 -1.684082 -1.549725
C  0.85529 1.748567 -0.169578
C  -5.716712 -3.050931 -2.043333
C  -6.455626 -0.672602 -1.605396
C  3.952477 -0.22684 -0.371448
C  3.96807 0.109101 0.919265
C  4.977645 -1.0567 -1.049802
C  5.004543 -0.303199 1.896152
C  6.216767 -1.162293 -0.159176
C  5.849447 -1.431199 1.299781
C  2.751683 0.374397 -1.000546
C  2.776574 0.946537 1.204433
H  -3.913317 0.756612 -1.223693
H  -1.843717 -0.940034 0.31604
H  -3.892009 2.369789 0.562904
H  -5.093223 1.606537 1.589866
H  -3.476595 1.910683 2.214656
H  -3.560187 -0.643388 2.839058
H  -5.08125 -0.902487 1.986318
H  -3.657118 -1.841431 1.551772
H  -3.396717 -2.220256 -1.077348
H  0.773734 2.574826 0.536745
H  0.782221 2.139584 -1.183913
H  -6.553825 -3.463674 -1.473866
H  -6.040068 -3.020089 -3.087437
H  -4.883848 -3.750632 -1.970951
H  -6.811901 -0.540111 -2.630634
H  -7.316675 -1.013118 -1.023882
H  -6.166041 0.305134 -1.22291
H  4.560675 -2.048302 -1.254508
H  5.22983 -0.63055 -2.023774
H  5.629633 0.561117 2.143535
H  4.540488 -0.615605 2.834838
H  6.868774 -1.953251 -0.532586
H  6.78628 -0.230695 -0.224932
H  6.753603 -1.563876 1.89567
H  5.29212 -2.370055 1.364685
elementType: O N C H
totalener: -1094.88050715 hartree
nucrepener: 2029.28585782 hartree
electener: -3124.16636497 hartree
oneelecener: -5520.60878814 hartree
twoeener: 2396.44242317 hartree
cpcmener: -0.03009848 hartree
kineticenergy: 1090.04496967 hartree
xcener: -105.969715060877 hartree
chargesum: 0.0000000
charge: -0.274851 -0.470478 -0.407610 -0.407647 -0.115003 0.141481 -0.012001 -0.110508 -0.298219 -0.267922 -0.248774 0.403250 -0.038634 0.091864 -0.228961 -0.249070 -0.068669 -0.073706 -0.073776 -0.071732 -0.135023 -0.136058 0.319576 0.317462 0.098731 0.090142 0.095617 0.094601 0.101971 0.099916 0.095466 0.090916 0.119797 0.135709 0.126083 0.093362 0.094262 0.088959 0.099552 0.095603 0.086964 0.101564 0.093680 0.100333 0.094078 0.081072 0.077731 0.080552 0.078347
qa: -0.2749 -0.4705 -0.4076 -0.4076 -0.1150 0.1415 -0.0120 -0.1105 -0.2982 -0.2679 -0.2488 0.4033 -0.0386 0.0919 -0.2290 -0.2491 -0.0687 -0.0737 -0.0738 -0.0717 -0.1350 -0.1361 0.3196 0.3175 0.0987 0.0901 0.0956 0.0946 0.1020 0.0999 0.0955 0.0909 0.1198 0.1357 0.1261 0.0934 0.0943 0.0890 0.0996 0.0956 0.0870 0.1016 0.0937 0.1003 0.0941 0.0811 0.0777 0.0806 0.0783
va: 2.1142 2.0354 2.1104 2.1100 3.1296 3.6671 3.7938 3.9054 3.8989 3.9076 3.8628 4.1551 3.7037 3.8820 3.9280 3.9396 3.6598 3.6747 3.9211 3.9205 3.9139 3.9159 4.2170 4.2185 1.0237 1.0351 1.0185 1.0009 0.9991 1.0027 1.0022 1.0024 1.0069 1.0010 1.0051 0.9962 0.9956 1.0077 0.9984 0.9976 1.0085 1.0048 1.0152 1.0045 1.0155 1.0096 1.0069 1.0095 1.0067
dispcorr: -0.022091133 hartree
energy: -1094.902598284271
dipole: -22.83250 23.97563 1.14314 -14.79703 13.20951 -1.58751 1.60939 -1.02413 0.58525
magnitude: 2.04193 au
magnitude: 5.19018 debye
