program: Orca
programVersion: 5.0.2
elementType: O O O O N C C C C C C C C C C C C C C C C C C C H H H H H H H H H H H H H H H H H H H H H H H H H
charge: 0
multiplicity: 1
keywords: wb97x-d3
keywords: def2-TZVPP
keywords: def2/J RIJCOSX
keywords: DEFGRID2
keywords: scfconv7
keywords: smallprint printgap noloewdin
keywords: NOSOSCF
formula: C19H25NO4
InChI: InChI=1/C19H25NO4/c1-11(2)9-14-15(19(14,3)4)18(23)24-10-20-16(21)12-7-5-6-8-13(12)17(20)22/h9,14-15H,5-8,10H2,1-4H3
49 atoms
O  -0.28467 1.198384 0.651525
O  -1.498826 2.020219 -1.044172
O  1.691063 0.052658 -1.655165
O  2.891738 1.723892 2.394102
N  2.006185 1.152925 0.341072
C  -3.834019 0.694069 0.610717
C  -3.498681 -0.149997 -0.581824
C  -2.390777 0.290792 0.350606
C  -4.293873 2.111483 0.37724
C  -4.484861 0.047044 1.808612
C  -3.850555 -1.583598 -0.669348
C  -1.383477 1.260024 -0.114597
C  -4.661376 -2.103459 -1.595113
C  0.850333 1.982646 0.302996
C  -4.956625 -3.57132 -1.637145
C  -5.316874 -1.267872 -2.662245
C  3.573921 -0.440706 -0.211465
C  3.924079 0.051047 0.977715
C  4.323419 -1.476736 -0.963049
C  5.115931 -0.366299 1.755859
C  5.723677 -1.624849 -0.365559
C  5.693511 -1.65366 1.162385
C  2.3281 0.233463 -0.64977
C  2.924839 1.074591 1.381049
H  -3.52769 0.391012 -1.522858
H  -2.003999 -0.463979 1.026809
H  -3.893391 2.547725 -0.53497
H  -5.382224 2.131662 0.294349
H  -4.018123 2.759781 1.211416
H  -4.326981 0.651601 2.703949
H  -5.562462 -0.043075 1.656864
H  -4.095891 -0.949791 2.012966
H  -3.411728 -2.245639 0.071397
H  0.964343 2.78363 1.031541
H  0.74146 2.41944 -0.687713
H  -6.026945 -3.759728 -1.517482
H  -4.675981 -4.001009 -2.602871
H  -4.428266 -4.12183 -0.858571
H  -4.60411 -0.97085 -3.436058
H  -6.113624 -1.819418 -3.16186
H  -5.755746 -0.352426 -2.263191
H  3.777661 -2.424504 -0.914178
H  4.375847 -1.214823 -2.02249
H  5.85853 0.437986 1.735785
H  4.854296 -0.505884 2.807504
H  6.187778 -2.536131 -0.745385
H  6.3483 -0.792476 -0.701965
H  6.700442 -1.812424 1.550993
H  5.0928 -2.50458 1.495624
elementType: O N C H
totalener: -1094.87886643 hartree
nucrepener: 2044.12151708 hartree
electener: -3139.00038351 hartree
oneelecener: -5550.53951883 hartree
twoeener: 2411.53913533 hartree
cpcmener: -0.03090608 hartree
kineticenergy: 1090.03430543 hartree
xcener: -105.969169256266 hartree
chargesum: -0.0000000
charge: -0.281520 -0.460621 -0.409871 -0.409282 -0.097534 0.132259 0.035221 -0.156167 -0.283901 -0.260717 -0.297402 0.422842 -0.011460 0.077615 -0.219759 -0.282154 -0.059307 -0.084403 -0.074215 -0.071285 -0.134431 -0.137096 0.317237 0.320667 0.095099 0.091172 0.093408 0.094895 0.098531 0.097900 0.096384 0.087684 0.119488 0.126568 0.138603 0.094176 0.098499 0.084529 0.105890 0.094354 0.100677 0.101361 0.092861 0.100816 0.094193 0.080652 0.078206 0.081017 0.078321
qa: -0.2815 -0.4606 -0.4099 -0.4093 -0.0975 0.1323 0.0352 -0.1562 -0.2839 -0.2607 -0.2974 0.4228 -0.0115 0.0776 -0.2198 -0.2822 -0.0593 -0.0844 -0.0742 -0.0713 -0.1344 -0.1371 0.3172 0.3207 0.0951 0.0912 0.0934 0.0949 0.0985 0.0979 0.0964 0.0877 0.1195 0.1266 0.1386 0.0942 0.0985 0.0845 0.1059 0.0944 0.1007 0.1014 0.0929 0.1008 0.0942 0.0807 0.0782 0.0810 0.0783
va: 2.1068 2.0509 2.1076 2.1090 3.1002 3.6889 3.7453 3.8971 3.9067 3.9084 3.8801 4.1591 3.6966 3.8517 3.9221 3.9427 3.6606 3.6966 3.9234 3.9190 3.9136 3.9167 4.2218 4.2272 1.0264 1.0380 1.0187 1.0008 0.9997 1.0028 1.0028 1.0046 1.0087 1.0112 1.0181 0.9942 0.9927 1.0100 0.9961 1.0044 0.9964 1.0048 1.0155 1.0047 1.0152 1.0097 1.0067 1.0094 1.0065
dispcorr: -0.021980872 hartree
energy: -1094.900847300457
dipole: -21.39712 22.41233 1.01522 -15.41173 13.95001 -1.46171 -3.02992 3.60317 0.57325
magnitude: 1.86973 au
magnitude: 4.75247 debye
