program: Orca
programVersion: 5.0.2
elementType: O O O O N C C C C C C C C C C C C C C C C C C C H H H H H H H H H H H H H H H H H H H H H H H H H
charge: 0
multiplicity: 1
keywords: wb97x-d3
keywords: def2-TZVPP
keywords: def2/J RIJCOSX
keywords: DEFGRID2
keywords: scfconv7
keywords: smallprint printgap noloewdin
keywords: NOSOSCF
formula: C19H25NO4
InChI: InChI=1/C19H25NO4/c1-11(2)9-14-15(19(14,3)4)18(23)24-10-20-16(21)12-7-5-6-8-13(12)17(20)22/h9,14-15H,5-8,10H2,1-4H3
49 atoms
O  -0.275612 1.305075 0.748596
O  -1.387809 2.011258 -1.067512
O  1.615205 0.250752 -1.63831
O  2.954085 1.67749 2.461147
N  2.015329 1.249905 0.396304
C  -3.785542 0.691513 0.51327
C  -3.372786 -0.162156 -0.646721
C  -2.323079 0.311052 0.331533
C  -4.250752 2.101251 0.247648
C  -4.488605 0.040996 1.679444
C  -3.689899 -1.608727 -0.721142
C  -1.314687 1.294077 -0.101013
C  -4.609433 -2.155935 -1.520966
C  0.867819 2.093517 0.44298
C  -4.83535 -3.637338 -1.540126
C  -5.481752 -1.369752 -2.450864
C  3.499326 -0.387244 -0.25403
C  3.899684 0.04602 0.94231
C  4.164723 -1.451212 -1.044743
C  5.10089 -0.438027 1.665739
C  5.16343 -2.196213 -0.157021
C  5.983275 -1.238245 0.706085
C  2.27904 0.362636 -0.639934
C  2.946018 1.081931 1.414983
H  -3.36072 0.361911 -1.597661
H  -1.955952 -0.424021 1.039813
H  -3.826155 2.531284 -0.657147
H  -5.336567 2.11225 0.132077
H  -4.005357 2.761285 1.082509
H  -4.097549 -0.950579 1.905642
H  -4.387795 0.650073 2.579909
H  -5.555289 -0.065641 1.470358
H  -3.119601 -2.266569 -0.07138
H  1.00221 2.827439 1.23529
H  0.750021 2.615225 -0.504603
H  -4.677184 -4.046087 -2.541985
H  -4.17126 -4.164669 -0.85514
H  -5.865289 -3.881951 -1.266687
H  -5.348888 -0.292508 -2.365133
H  -5.295013 -1.648642 -3.491627
H  -6.53601 -1.587236 -2.260386
H  3.421218 -2.137046 -1.458356
H  4.669798 -1.001953 -1.905972
H  5.651898 0.403184 2.093281
H  4.788424 -1.055734 2.514032
H  4.621192 -2.892027 0.489866
H  5.825726 -2.799877 -0.779146
H  6.528875 -0.545887 0.058247
H  6.733101 -1.791203 1.27367
elementType: O N C H
totalener: -1094.87956068 hartree
nucrepener: 2052.39743533 hartree
electener: -3147.27699600 hartree
oneelecener: -5567.14873078 hartree
twoeener: 2419.87173478 hartree
cpcmener: -0.03146589 hartree
kineticenergy: 1090.03647785 hartree
xcener: -105.969798646423 hartree
chargesum: 0.0000000
charge: -0.283537 -0.457493 -0.408805 -0.409684 -0.098969 0.148135 0.000673 -0.150566 -0.290410 -0.261171 -0.265894 0.423507 -0.030733 0.079840 -0.228372 -0.252497 -0.060004 -0.083371 -0.070879 -0.073490 -0.134338 -0.135329 0.313720 0.323236 0.096941 0.092579 0.093715 0.094905 0.099786 0.089584 0.098222 0.095683 0.118614 0.124680 0.139653 0.094271 0.088696 0.093433 0.087901 0.098853 0.094247 0.093870 0.099925 0.093486 0.101210 0.078136 0.079904 0.077533 0.080604
qa: -0.2835 -0.4575 -0.4088 -0.4097 -0.0990 0.1481 0.0007 -0.1506 -0.2904 -0.2612 -0.2659 0.4235 -0.0307 0.0798 -0.2284 -0.2525 -0.0600 -0.0834 -0.0709 -0.0735 -0.1343 -0.1353 0.3137 0.3232 0.0969 0.0926 0.0937 0.0949 0.0998 0.0896 0.0982 0.0957 0.1186 0.1247 0.1397 0.0943 0.0887 0.0934 0.0879 0.0989 0.0942 0.0939 0.0999 0.0935 0.1012 0.0781 0.0799 0.0775 0.0806
va: 2.1077 2.0566 2.1094 2.1089 3.0978 3.6766 3.7691 3.8827 3.9050 3.9048 3.8776 4.1738 3.7072 3.8554 3.9269 3.9447 3.6607 3.6921 3.9218 3.9207 3.9144 3.9128 4.2266 4.2264 1.0269 1.0380 1.0173 1.0010 0.9995 1.0029 1.0030 1.0032 1.0084 1.0134 1.0186 0.9951 1.0081 0.9964 1.0079 0.9973 0.9978 1.0153 1.0053 1.0157 1.0053 1.0068 1.0099 1.0072 1.0095
dispcorr: -0.022272563 hartree
energy: -1094.901833241583
dipole: -22.03399 22.90855 0.87456 -16.45168 14.93484 -1.51683 -3.35411 3.91692 0.56281
magnitude: 1.83913 au
magnitude: 4.67470 debye
